program: Gaussian 09
title: 000051208
version: EM64L-G09RevD.01
frameworkgroup: C1[X(C22H25FN2O2S)]
method: RPBEPBE
basis: SDD
operation: Freq
keyword: #p
keyword: freq=noraman
keyword: PBEPBE/SDD
title: #p freq=noraman PBEPBE/SDD
converged: YES YES NO NO
title: Mulliken charges:
elementType: S F O O N N C C C C C C C C C C C C C C C C C C C C C C H H H H H H H H H H H H H H H H H H H H H H H H H
charge: 0.145527 -0.204779 -0.456160 -0.225394 -0.094689 -0.088109 -0.182116 -0.371885 -0.357171 -0.386516 -0.397423 -0.663755 0.635122 -0.314203 0.692813 -0.367953 -0.592333 -0.282132 -0.335440 -0.411020 -0.266235 0.336173 -0.389313 -0.445050 -0.401575 0.336001 0.089823 -0.792574 0.201184 0.186079 0.226905 0.226841 0.184675 0.200334 0.196421 0.208834 0.194997 0.236098 0.251895 0.204369 0.219756 0.253459 0.205175 0.191146 0.238885 0.254979 0.285545 0.275694 0.259055 0.345884 0.238487 0.239146 0.264522
chargesum: 0.00000
title: Mulliken charges with hydrogens summed into heavy atoms:
elementType: S F O O N N C C C C C C C C C C C C C C C C C C C C C C
charge: 0.145527 -0.204779 -0.110277 -0.225394 -0.094689 -0.088109 0.019068 0.041099 0.054346 0.010240 0.006407 -0.175762 0.635122 0.109922 0.692813 -0.367953 -0.338874 -0.282132 0.060881 -0.172135 -0.011256 0.336173 -0.103768 -0.169356 -0.142520 0.336001 0.089823 -0.050418
polarizability: 3.76698201e+02 7.76309053e+01 2.67509936e+02 1.99171454e+01 -1.95202352e+01 2.28019303e+02
1716.lowfreq: -7.9171 -6.7458 0.0012 0.0014 0.0017 4.9971 14.5481 17.2283 32.9017
frequency: 13.7497 17.2219 32.6147 40.0182 53.8179 57.9145 60.7357 80.4804 86.0375 93.1821 117.5945 143.9226 148.2704 164.5674 174.4887 184.5862 202.1424 229.9290 241.3218 246.1723 251.6042 272.2968 279.9115 298.0921 323.5559 335.8528 345.5345 356.2752 369.2557 393.7543 406.9148 434.1630 442.6735 449.7200 453.9208 463.3337 480.9663 493.1648 531.7564 543.6316 559.6153 592.8926 600.6616 623.8011 650.5847 662.3266 670.3748 698.4055 704.5166 732.4383 751.7477 779.9506 802.3273 816.3241 835.9600 847.4398 853.4305 856.9085 862.9987 877.0602 911.5391 932.6654 938.0705 945.6953 958.0100 975.3488 992.4748 992.9310 1002.0013 1023.2565 1025.6535 1032.4716 1040.6413 1047.4287 1052.1863 1080.4835 1090.1254 1100.0379 1121.2151 1127.0509 1135.0448 1139.3679 1144.9668 1162.4791 1172.3877 1181.2053 1195.0716 1206.7125 1213.3538 1223.0188 1232.9679 1251.9010 1255.9709 1268.2498 1270.9562 1284.4606 1289.8668 1295.9407 1306.8591 1329.9658 1333.2689 1343.3965 1345.3739 1358.5966 1367.2998 1375.4017 1379.4622 1382.0969 1384.6580 1387.3368 1412.4708 1419.0021 1447.3963 1451.0961 1452.3082 1459.3557 1461.6116 1465.2369 1470.1601 1473.5335 1475.2992 1485.7889 1486.6958 1554.9499 1590.2165 1593.0074 1602.0865 1605.6783 2810.0670 2850.2669 2860.6738 2867.2336 2876.8441 2901.6721 2947.0956 2983.9614 2991.0310 3004.8535 3033.5873 3037.5892 3043.0284 3050.7292 3058.8698 3061.8332 3068.1300 3124.4380 3127.6285 3130.2820 3137.4265 3159.2034 3164.4156 3181.6404 3578.2373
redmass: 7.7963 6.0873 3.2897 4.3635 4.6381 3.4146 3.5504 5.6910 4.4187 4.3669 5.3325 1.0270 4.2863 4.9713 5.4222 5.2608 4.6200 4.1270 3.4717 1.9396 1.1758 4.1384 4.4929 3.8067 2.7553 5.2808 4.4323 4.2506 3.3915 4.9835 2.0878 4.7610 3.4406 4.1557 4.1171 5.0402 2.8960 4.4063 3.9665 5.4227 4.8626 3.2767 4.2278 3.0758 3.4113 4.6045 4.8064 3.9972 4.6443 4.1192 3.5354 3.3443 1.4353 1.1953 4.3266 1.5285 1.3535 3.9435 1.5326 4.6927 1.5928 1.9629 1.7062 2.0348 2.1124 5.8750 1.3562 2.7433 2.6701 2.6106 1.8420 4.2869 2.6569 2.4068 1.7941 1.8681 2.1120 2.1711 2.5734 1.6690 1.4265 2.9017 2.7384 1.6901 1.9250 1.4468 1.0911 1.3733 3.2241 1.5085 1.5842 1.3353 1.6438 1.3308 1.2818 1.7796 1.7507 1.3195 1.2553 1.4503 1.3462 1.3284 1.6734 1.4542 1.3681 4.4856 1.7892 1.4923 3.9952 2.4107 2.6059 1.4809 1.1011 1.0804 1.0795 1.0986 1.0503 1.1339 1.6670 1.1222 1.6514 1.0934 1.9748 7.1669 8.2219 7.3143 7.0000 6.5333 1.0809 1.0712 1.0700 1.0705 1.0689 1.0693 1.0572 1.0375 1.0623 1.1023 1.0888 1.0909 1.0996 1.0938 1.0863 1.0887 1.0969 1.0986 1.0899 1.0907 1.0888 1.0924 1.0959 1.0956 1.0666
irintensity: 0.0379 0.1322 3.4952 2.0589 0.6970 2.4371 8.2173 2.8376 1.2389 0.4644 1.1630 0.2907 4.2161 0.5320 4.0949 0.8018 0.1926 1.5671 3.2938 27.6243 120.9362 2.4634 2.5718 2.0848 8.5426 9.2865 1.0436 0.5097 5.5566 2.2884 0.7871 10.3180 3.8922 5.9960 1.4613 0.7369 0.2649 2.0308 0.4118 7.2117 5.3246 8.8125 13.9401 2.2131 3.5892 14.7830 1.7794 16.6294 1.0569 7.7495 7.1038 8.8183 38.5852 1.0803 34.5491 0.2401 50.6008 5.8451 26.4857 62.5596 22.3403 0.9690 5.1180 46.6970 10.5980 131.7345 1.2931 47.0828 1.7465 11.3139 0.7611 76.3084 22.0288 3.6623 2.1062 4.6614 14.8812 2.5473 45.8354 6.6402 0.8127 33.3599 42.3887 4.6171 20.8114 7.6769 0.4358 29.8601 39.6422 45.1290 23.5778 19.7251 49.6918 14.9437 0.3881 157.4438 89.0610 28.4766 6.0331 18.2943 7.0844 1.7328 7.8845 0.4136 56.9557 4.7654 12.7853 2.8614 0.5606 4.9400 12.1973 0.2338 44.2859 3.6973 0.6203 19.7129 21.7516 5.4506 15.3049 6.5043 33.9828 8.6335 121.5042 230.4678 18.0528 256.5755 58.2755 19.8265 59.1401 62.7515 23.5465 23.2272 156.3698 94.5252 64.1413 3.8143 21.8224 43.1064 28.8396 40.1057 14.6187 52.5913 45.8983 11.0609 12.7209 22.4291 10.4460 6.2269 1.4368 0.2288 3.2675 2.3015 3.6245
temp: 298.150 k
press: 1.00000 atm
elementType: 16 9 8 8 7 7 6 6 6 6 6 6 6 6 6 6 6 6 6 6 6 6 6 6 6 6 6 6 1 1 1 1 1 1 1 1 1 1 1 1 1 1 1 1 1 1 1 1 1 1 1 1 1
symmnumber: 1
zpe: 1116465.6 jmol-1
zpe.correction: 0.425239 hartree
zpe.thermalcorrener: 0.451942 hartree
zpe.thermalcorrenthalpy: 0.452887 hartree
zpe.thermalcorrgfe: 0.365857 hartree
zpe.sumelectzpe: -1609.086852 hartree
zpe.sumelectthermal: -1609.060149 hartree
zpe.sumelectthermalent: -1609.059205 hartree
zpe.sumelectthermalfe: -1609.146235 hartree
dipole: 1.9568 -1.8006 4.8968
dipole: 5.5722
quadrupole: -202.7912 -175.8600 -162.4169
quadrupole: -11.0201 6.6674 -6.3418
quadrupole: -22.4351 4.4960 17.9391 -11.0201 6.6674 -6.3418
hfenergy: -1609.5120918 hartree
pointgroup: C01 [X(C22H25F1N2O2S1)]
dipole: -0.9483072 -0.1061532 -1.9737059 debye
polarizability: 285.3093199|-90.4085981|355.5416864|21.8373797|14.4388013|231.3764329 unknown
InChI: InChI=1S/C22H25FN2O2S/c1-15(27)16-3-5-21-19(12-16)20(25-8-6-24(7-9-25)10-11-26)13-17-2-4-18(23)14-22(17)28-21/h2-5,12,14,20,26H,6-11,13H2,1H3
charge 0 multiplicity 1
53 atoms
S  1.456326 1.275877 1.702669
F  -0.918936 5.741992 1.213679
O  -7.30732 -1.267081 0.440126
O  4.830749 -4.495807 0.352269
N  -0.828795 -0.267097 -0.445363
N  -3.594512 -1.050104 0.05569
C  0.489596 -0.298222 -1.141456
C  -1.930286 0.12151 -1.366454
C  -1.170449 -1.552087 0.224689
C  -3.260985 0.234088 -0.606005
C  -2.500156 -1.426116 0.98367
C  0.901088 1.118084 -1.681066
C  1.595318 -0.880947 -0.268639
C  -4.930425 -1.046456 0.698727
C  0.442727 2.309761 -0.857193
C  2.0884 -0.242767 0.901164
C  2.203176 -2.095493 -0.66464
C  0.622277 2.435378 0.54524
C  -6.04679 -1.308096 -0.321663
C  -0.201732 3.381308 -1.533306
C  3.14158 -0.837718 1.651775
C  3.251512 -2.702293 0.070762
C  3.711641 -2.052761 1.2482
C  0.160191 3.584948 1.238091
C  -0.660155 4.540295 -0.87516
C  -0.466929 4.60527 0.513686
C  3.894446 -3.994534 -0.339608
C  3.403476 -4.69811 -1.601965
H  0.425594 -0.964973 -2.042791
H  -2.044711 -0.629575 -2.189736
H  -1.70154 1.101039 -1.818485
H  -0.371696 -1.810228 0.940323
H  -1.256144 -2.385927 -0.517648
H  -3.178671 1.066155 0.13842
H  -4.0610 0.497982 -1.321402
H  -2.744361 -2.399595 1.44728
H  -2.371809 -0.67292 1.801233
H  0.504306 1.240133 -2.705082
H  2.003795 1.120818 -1.781318
H  -5.146438 -0.09122 1.234722
H  -4.964251 -1.854869 1.451445
H  1.826507 -2.578333 -1.573661
H  -5.885316 -2.298881 -0.793335
H  -6.043702 -0.532631 -1.117076
H  -0.341901 3.299163 -2.617655
H  3.515599 -0.329045 2.547073
H  4.525101 -2.515603 1.816073
H  0.287383 3.690717 2.32005
H  -1.149612 5.358579 -1.409336
H  -8.064869 -1.466665 -0.164365
H  3.523877 -4.052062 -2.491632
H  2.330919 -4.956495 -1.521855
H  3.985407 -5.620787 -1.74636
