program: Gaussian 09
title: 000051121
version: EM64L-G09RevD.01
frameworkgroup: C1[X(C12H3Cl5O)]
method: RPBEPBE
basis: SDD
operation: Freq
keyword: #p
keyword: freq=noraman
keyword: PBEPBE/SDD
title: #p freq=noraman PBEPBE/SDD
converged: NO YES NO NO
title: Mulliken charges:
elementType: Cl Cl Cl Cl Cl O C C C C C C C C C C C C H H H
charge: 0.009265 -0.000083 0.058361 0.012592 0.017773 -0.221573 0.423392 0.411296 0.345160 0.336464 -0.353966 -0.358984 -0.322266 -0.347777 -0.245853 -0.116477 -0.224478 -0.235143 0.284717 0.262823 0.264757
chargesum: 0.00000
title: Mulliken charges with hydrogens summed into heavy atoms:
elementType: Cl Cl Cl Cl Cl O C C C C C C C C C C C C
charge: 0.009265 -0.000083 0.058361 0.012592 0.017773 -0.221573 0.423392 0.411296 0.345160 0.336464 -0.353966 -0.358984 -0.322266 -0.347777 0.038864 -0.116477 0.038345 0.029614
polarizability: 2.70946744e+02 -2.33195730e+00 2.36818423e+02 2.31090713e-03 2.70321247e-04 6.32607618e+01
1716.lowfreq: -7.4625 -3.9857 -0.0017 -0.0010 0.0013 4.3786 25.9979 54.9488 84.2502
frequency: 25.9394 54.9477 84.2497 93.9346 106.3536 152.6810 161.1539 177.1070 186.2422 201.8916 258.5312 282.5007 301.1625 312.1455 330.0951 337.3591 365.9892 417.8642 458.4123 520.9377 536.7203 536.9277 551.2401 571.4141 593.3374 609.1217 663.0054 701.6248 724.4930 758.7112 763.1919 804.4795 853.0764 860.8023 903.8287 923.5087 933.5730 1032.2294 1116.2131 1126.5489 1175.2447 1196.9013 1224.0792 1249.3617 1305.5683 1335.7940 1382.4480 1413.4599 1432.1519 1459.1131 1541.9753 1565.8031 1590.8507 1623.6714 3168.3418 3183.1083 3186.3903
redmass: 29.3263 20.2122 8.0909 17.5602 27.5913 26.7741 8.5963 26.8082 27.5698 19.9909 10.0018 7.0091 19.3598 28.4990 6.1602 21.8104 9.7230 10.0765 8.6838 9.1177 5.5131 9.3612 4.8620 5.5230 9.1791 8.2156 8.3411 9.9924 8.4145 9.7631 11.5778 1.3291 1.4026 11.0184 8.2233 11.1293 1.3410 10.0645 2.7302 2.9521 1.7289 4.8859 2.3700 2.2642 7.7352 4.4913 10.9235 10.9171 3.7731 3.3484 9.4852 8.6339 10.4313 10.8473 1.0887 1.0926 1.0972
irintensity: 0.0068 0.2393 0.8497 0.0311 0.1970 0.2251 1.0722 0.1850 0.0993 0.4256 0.1551 0.0004 1.7249 0.0417 0.0680 2.4719 2.1841 0.4182 12.4924 15.0499 2.2696 17.5701 1.0597 18.5630 3.5973 0.8904 4.8955 10.4240 0.3555 0.0027 21.2339 42.3577 20.5714 53.8635 45.1110 88.7237 0.0094 31.5737 84.5353 118.2697 31.0248 3.1519 25.7303 4.6223 38.5461 90.0410 0.3649 18.4137 25.8026 111.2519 20.9820 3.0363 64.1458 9.1169 0.4894 1.9617 0.1964
temp: 298.150 k
press: 1.00000 atm
elementType: 17 17 17 17 17 8 6 6 6 6 6 6 6 6 6 6 6 6 1 1 1
symmnumber: 1
zpe: 295643.9 jmol-1
zpe.correction: 0.112605 hartree
zpe.thermalcorrener: 0.128150 hartree
zpe.thermalcorrenthalpy: 0.129094 hartree
zpe.thermalcorrgfe: 0.067619 hartree
zpe.sumelectzpe: -2833.353379 hartree
zpe.sumelectthermal: -2833.337834 hartree
zpe.sumelectthermalent: -2833.336890 hartree
zpe.sumelectthermalfe: -2833.398364 hartree
dipole: -1.8110 0.9220 0.0000
dipole: 2.0322
quadrupole: -124.1113 -142.6933 -138.1512
quadrupole: 4.0708 0.0003 0.0001
quadrupole: 10.8740 -7.7080 -3.1659 4.0708 0.0003 0.0001
hfenergy: -2833.4659839 hartree
pointgroup: C01 [X(C12H3Cl5O1)]
dipole: 0.674982 0.4285424 -0.000014 debye
dipolederiv: -0.1041478 -0.0822854 0.0000122 -0.0019197 -0.6965814 0.0000978 -0.0000014 0.0000945 -0.0194247 -0.0965349 0.0165596 0.000002 -0.1266728 -0.7073165 -0.0000996 -0.0000186 -0.0000938 -0.0257954 -0.0606677 -0.1238503 0.0000032 -0.2280896 -0.5775043 0.0000165 0.0000101 0.0000089 0.0236137 -0.1058223 0.1013975 0.0000026 0.2245806 -0.6798487 -0.0000197 0.0000096 -0.0000118 -0.0097735 -0.8415098 -0.1346602 0.0000123 -0.1530782 -0.0778819 0.000006 0.0000147 0.0000012 -0.0136011 -1.2686025 0.0370171 -0.0000239 0.057747 -0.3993739 0.0000009 -0.0000315 0.0000005 -0.1236879 0.0783822 -0.1815509 0.0000298 0.2398258 -0.3260791 0.0000437 0.0000441 0.0000419 0.0271866 0.1615734 0.1429914 0.0000256 -0.2786953 -0.27538 -0.0000447 0.0000356 -0.0000439 0.0438676 0.6596259 -0.2004544 -0.0000041 -0.6174469 0.0931738 -0.000006 -0.0000068 0.0000043 0.146445 0.6388822 0.1571626 0.0000008 0.6327793 -0.0502381 0.0000034 -0.0000065 -0.0000031 0.1211162 0.3590698 0.2685751 -0.000041 -0.1698543 1.0956179 -0.0001884 -0.0000176 -0.0001857 -0.0724328 0.2002257 -0.1722479 -0.0000214 0.3043115 1.0811498 0.000192 0.0000102 0.0001825 -0.0780128 -0.2725695 0.3190033 -0.0000024 0.3399406 0.866249 -0.000006 -0.0000017 -0.0000086 -0.1036574 0.0369853 -0.2408411 -0.0000081 -0.4240638 1.0657737 0.0000166 -0.0000069 0.0000137 -0.1109315 -0.4657992 -0.1965231 0.0000269 -0.1940507 -0.3332087 0.0000353 0.0000144 0.0000433 -0.0623082 1.1821952 0.0662942 -0.000025 0.2710635 0.1304038 -0.0000219 -0.0000419 -0.0000283 -0.0416944 -0.1007157 0.1401957 0.0000182 0.0765297 -0.262751 -0.0000291 0.000005 -0.0000362 -0.1103739 -0.0827609 0.0616023 -0.0000016 0.0427311 -0.1004405 0.0000118 -0.0000069 0.0000205 -0.0938154 0.0572773 0.0200575 -0.0000028 0.023428 0.051023 0.000008 0.0000024 0.0000245 0.1683566 0.0197275 -0.0438023 -0.0000053 -0.058554 0.0274949 -0.0000102 -0.000006 -0.0000251 0.1659994 0.0051857 0.0453594 0.0000019 0.039488 0.0757182 -0.0000062 -0.0000002 0.0000006 0.1689241 unknown
polarizability: 270.2017446|5.5053217|237.5634225|0.0023261|-0.0000504|63.2607618 unknown
InChI: InChI=1S/C12H3Cl5O/c13-4-1-2-5(14)11-8(4)9-6(15)3-7(16)10(17)12(9)18-11/h1-3H
charge 0 multiplicity 1
21 atoms
Cl -1.145286 3.412151 -0.000425
Cl 2.0983 3.225838 0.000379
Cl -2.629104 -2.869335 0.000004
Cl 2.875245 -3.182085 -0.000063
Cl -4.946512 -0.500996 -0.000007
O  0.18395 -1.626792 -0.000029
C  -0.419541 0.647454 -0.000062
C  1.059193 0.560424 0.000016
C  -0.878542 -0.712654 -0.00004
C  1.352021 -0.845711 -0.000013
C  -1.446798 1.63075 -0.000161
C  2.19358 1.418699 0.000116
C  -2.219066 -1.123471 -0.000029
C  2.63913 -1.395232 -0.000026
C  -2.805009 1.257377 -0.000124
C  -3.187927 -0.102135 -0.000048
C  3.498477 0.883713 0.000079
C  3.730958 -0.511587 -0.000001
H  -3.576939 2.030587 -0.000187
H  4.349946 1.56922 0.000141
H  4.753125 -0.899114 -0.00002
