program: Orca
programVersion: 5.0.3
elementType: C H C H C C C H H C H H C C H H H H H H H
charge: 1
multiplicity: 1
keywords: DSD-PBEP86 cc-pVTZ EnGrad RIJCOSX verytightscf cc-pVTZ/C def2/J soscf
formula: C8H13
InChI: InChI=1/C8H13/c1-2-4-6-8-7-5-3-1/h1-2,7H,3-6,8H2
21 atoms
C  -1.999288 0.523304 0.11658
H  -2.180586 0.724731 1.175756
C  -1.97688 -1.004902 -0.164804
H  -2.678298 -1.600968 0.42035
C  -0.531002 -1.106559 0.275424
C  0.602314 -1.099382 -0.511677
C  1.904826 -0.642386 0.05884
H  1.999235 -0.954549 1.104325
H  2.751817 -1.045886 -0.502284
C  1.9118 0.924194 -0.023736
H  2.060897 1.228753 -1.066096
H  2.7524 1.320557 0.551754
C  0.565465 1.478707 0.484204
C  -0.526669 0.764279 -0.25245
H  0.523597 -1.289093 -1.581628
H  -2.103573 -1.226187 -1.228392
H  0.453349 1.377977 1.568876
H  -0.411535 0.836678 -1.337145
H  -2.692299 1.111554 -0.491989
H  0.497196 2.550631 0.245234
H  -0.377558 -1.057909 1.35444
totalener: -311.18040699 hartree
nucrepener: 386.56704692 hartree
electener: -697.74745390 hartree
oneelecener: -1173.33127590 hartree
twoeener: 475.58382200 hartree
kineticenergy: 309.74923069 hartree
exchangeener: -12.762321941870 hartree
correlationener: -0.948982165774 hartree
xcener: -13.711304107645 hartree
chargesum: 1.0000000
charge: -0.216261 0.169000 -0.241784 0.185878 -0.055578 -0.050891 -0.254354 0.166589 0.185241 -0.252384 0.162972 0.183343 -0.237470 -0.085447 0.227217 0.169839 0.163417 0.199273 0.184091 0.195783 0.201527
charge: 0.101818 0.000029 0.104898 -0.000540 0.121899 0.176937 0.083796 0.002474 0.007303 0.096795 -0.005817 0.000378 0.064866 0.206212 0.004719 -0.000035 -0.001958 0.003298 -0.000349 0.020181 0.013098
qa: -0.2163 0.1690 -0.2418 0.1859 -0.0556 -0.0509 -0.2544 0.1666 0.1852 -0.2524 0.1630 0.1833 -0.2375 -0.0854 0.2272 0.1698 0.1634 0.1993 0.1841 0.1958 0.2015
va: 3.8675 0.9858 3.8880 0.9763 3.7966 3.7763 3.9232 0.9830 0.9757 3.8948 0.9806 0.9723 3.8969 3.7595 0.9587 0.9855 0.9839 0.9786 0.9742 0.9676 0.9773
energy: -311.884661466346
dipole: 0.55725 -0.69325 -0.13600 1.84993 -1.86758 -0.01765 0.19965 -0.36333 -0.16368
magnitude: 0.21354 au
magnitude: 0.54278 debye
