program: Orca
programVersion: 5.0.3
elementType: C H C H C C C H H C H H C C H H H H H H H
charge: 1
multiplicity: 1
keywords: b3lyp cc-pVTZ EnGrad RIJCOSX verytightscf cc-pVTZ/C def2/J soscf
formula: C8H13
InChI: InChI=1/C8H13/c1-2-4-6-8-7-5-3-1/h1-2,7H,3-6,8H2
21 atoms
C  -1.999505 0.521185 0.113332
H  -2.182929 0.728382 1.170986
C  -1.984345 -1.008092 -0.161191
H  -2.679588 -1.602931 0.432279
C  -0.535619 -1.096274 0.27446
C  0.598386 -1.090107 -0.514615
C  1.904013 -0.638622 0.055082
H  1.997855 -0.956729 1.098841
H  2.747051 -1.045485 -0.509467
C  1.918473 0.928281 -0.018234
H  2.077538 1.239058 -1.057198
H  2.755255 1.317376 0.567697
C  0.568012 1.476978 0.482474
C  -0.518642 0.744065 -0.249381
H  0.518562 -1.283964 -1.583688
H  -2.115776 -1.23619 -1.222679
H  0.456175 1.382488 1.56782
H  -0.407119 0.821457 -1.334242
H  -2.682661 1.114409 -0.501041
H  0.488028 2.545838 0.236148
H  -0.380201 -1.049322 1.353155
totalener: -312.25234076 hartree
nucrepener: 386.92525414 hartree
electener: -699.17759490 hartree
oneelecener: -1174.65757691 hartree
twoeener: 475.47998201 hartree
kineticenergy: 310.01738391 hartree
exchangeener: -36.330865805091 hartree
correlationener: -2.310193791017 hartree
xcener: -38.641059596108 hartree
chargesum: 1.0000000
charge: -0.158291 0.140295 -0.180239 0.154656 -0.020034 -0.016467 -0.187484 0.136196 0.155200 -0.191622 0.134456 0.151726 -0.171929 -0.053829 0.189535 0.139045 0.131801 0.165492 0.152927 0.162374 0.166194
charge: 0.108713 -0.001837 0.110899 -0.002654 0.119717 0.181631 0.089714 0.001188 0.006019 0.101876 -0.007332 -0.001048 0.070994 0.196944 0.002719 -0.002180 -0.003950 0.002154 -0.002796 0.017802 0.011428
qa: -0.1583 0.1403 -0.1802 0.1547 -0.0200 -0.0165 -0.1875 0.1362 0.1552 -0.1916 0.1345 0.1517 -0.1719 -0.0538 0.1895 0.1390 0.1318 0.1655 0.1529 0.1624 0.1662
va: 3.8235 0.9923 3.8438 0.9835 3.7561 3.7337 3.8725 0.9900 0.9831 3.8445 0.9871 0.9811 3.8469 3.7045 0.9760 0.9926 0.9919 0.9958 0.9814 0.9766 0.9939
energy: -312.252340757566
dipole: 0.55495 -0.66700 -0.11206 1.84815 -1.88194 -0.03379 0.20473 -0.36980 -0.16508
magnitude: 0.20236 au
magnitude: 0.51435 debye
