program: Orca
programVersion: 5.0.3
elementType: C H C H C C C H H C H H C C H H H H H H H
charge: 1
multiplicity: 1
keywords: b3lyp cc-pVTZ EnGrad RIJCOSX verytightscf cc-pVTZ/C def2/J soscf
formula: C8H13
InChI: InChI=1/C8H13/c1-2-4-6-8-7-5-3-1/h1-2,7H,3-6,8H2
21 atoms
C  -2.001526 0.683085 0.073948
H  -2.177148 0.792327 1.148996
C  -1.760842 -0.962024 -0.172013
H  -2.630623 -1.398729 0.32691
C  -0.412113 -1.363819 0.375976
C  0.670936 -1.265213 -0.406151
C  1.979287 -0.707771 0.067492
H  2.171943 -0.934104 1.121385
H  2.842533 -1.037132 -0.519618
C  1.799836 0.831751 -0.121115
H  1.83386 1.092782 -1.184755
H  2.610917 1.375829 0.37035
C  0.4425 1.349196 0.500277
C  -0.746418 1.261009 -0.335913
H  0.515765 -1.198539 -1.487283
H  -1.835842 -1.1413 -1.247283
H  0.267383 0.932158 1.493932
H  -0.651414 1.620099 -1.365599
H  -2.862765 0.990204 -0.522123
H  0.573359 2.448711 0.61797
H  -0.315027 -1.434675 1.45913
totalener: -312.21755069 hartree
nucrepener: 379.19106155 hartree
electener: -691.40861224 hartree
oneelecener: -1159.44052169 hartree
twoeener: 468.03190945 hartree
kineticenergy: 309.97194718 hartree
exchangeener: -36.297069150884 hartree
correlationener: -2.303253748246 hartree
xcener: -38.600322899130 hartree
chargesum: 1.0000000
charge: -0.184091 0.164186 -0.181585 0.162571 -0.130199 -0.111258 -0.168694 0.129841 0.147140 -0.192474 0.131298 0.151616 -0.166476 0.104072 0.135636 0.153357 0.141272 0.209634 0.169382 0.184487 0.150285
charge: 0.122639 0.012921 0.143677 0.001286 0.041818 0.049834 0.074729 -0.004303 0.000372 0.116283 -0.010501 -0.001717 0.087385 0.331256 -0.020027 -0.002970 0.005035 0.020130 0.006637 0.049925 -0.024410
qa: -0.1841 0.1642 -0.1816 0.1626 -0.1302 -0.1113 -0.1687 0.1298 0.1471 -0.1925 0.1313 0.1516 -0.1665 0.1041 0.1356 0.1534 0.1413 0.2096 0.1694 0.1845 0.1503
va: 3.8171 0.9839 3.8530 0.9769 3.7858 3.8082 3.8565 0.9932 0.9836 3.8349 0.9895 0.9800 3.8584 3.5040 0.9935 0.9850 0.9988 0.9668 0.9829 0.9741 0.9941
energy: -312.217550691541
dipole: 0.32115 -1.02878 -0.70763 1.97318 -0.65811 1.31507 0.19851 -0.32727 -0.12876
magnitude: 1.49891 au
magnitude: 3.80993 debye
