program: Orca
programVersion: 5.0.3
elementType: C H C H C C C H H C H H C C H H H H H H H
charge: 1
multiplicity: 1
keywords: DSD-PBEP86 cc-pVTZ EnGrad D3BJ RIJCOSX verytightscf cc-pVTZ/C def2/J soscf
formula: C8H13
InChI: InChI=1/C8H13/c1-2-4-6-8-7-5-3-1/h1-2,7H,3-6,8H2
21 atoms
C  -2.002287 0.748589 0.069263
H  -2.165995 0.812579 1.147735
C  -1.731773 -0.975169 -0.165306
H  -2.619813 -1.337002 0.357393
C  -0.411445 -1.385725 0.387881
C  0.681712 -1.271167 -0.387058
C  1.996368 -0.699275 0.062917
H  2.199941 -0.908185 1.118588
H  2.853174 -1.036974 -0.526831
C  1.788007 0.84059 -0.133147
H  1.821748 1.104525 -1.196024
H  2.593044 1.391331 0.360572
C  0.425747 1.289644 0.496447
C  -0.765642 1.290842 -0.358668
H  0.516923 -1.190542 -1.466208
H  -1.829139 -1.135363 -1.239803
H  0.219422 0.741716 1.419163
H  -0.658899 1.633695 -1.391646
H  -2.881602 0.99802 -0.523273
H  0.51051 2.35537 0.805363
H  -0.325572 -1.472508 1.470219
totalener: -311.10671900 hartree
nucrepener: 379.16040477 hartree
electener: -690.26712376 hartree
oneelecener: -1158.73946133 hartree
twoeener: 468.47233757 hartree
kineticenergy: 309.73239109 hartree
exchangeener: -13.662205712494 hartree
correlationener: -0.920985746148 hartree
xcener: -14.583191458642 hartree
chargesum: 1.0000000
charge: -0.266180 0.201028 -0.236462 0.199248 -0.159149 -0.126320 -0.235768 0.157719 0.174467 -0.254051 0.158000 0.177287 -0.242656 0.095973 0.163739 0.190094 0.161829 0.237967 0.202066 0.213498 0.187669
charge: 0.132837 0.013906 0.176721 0.005633 0.022526 0.062040 0.072232 -0.004097 -0.002146 0.105427 -0.011267 -0.001257 0.078799 0.310499 -0.017221 -0.001433 0.006076 0.020191 0.005689 0.047028 -0.022185
qa: -0.2662 0.2010 -0.2365 0.1992 -0.1591 -0.1263 -0.2358 0.1577 0.1745 -0.2541 0.1580 0.1773 -0.2427 0.0960 0.1637 0.1901 0.1618 0.2380 0.2021 0.2135 0.1877
va: 3.8836 0.9710 3.9031 0.9657 3.8164 3.8471 3.9035 0.9868 0.9775 3.8874 0.9840 0.9742 3.9117 3.5536 0.9837 0.9725 0.9960 0.9545 0.9736 0.9636 0.9800
dispcorr: -0.011855259 hartree
energy: -311.810747303268
dipole: 0.21888 -1.11231 -0.89343 1.83229 -0.64662 1.18567 0.31390 -0.45276 -0.13886
magnitude: 1.49107 au
magnitude: 3.79001 debye
