program: Orca
programVersion: 5.0.3
elementType: C H C H C C C H H C H H C C H H H H H H H
charge: 1
multiplicity: 1
keywords: PBE0 cc-pVTZ EnGrad D3BJ RIJCOSX verytightscf cc-pVTZ/C def2/J soscf
formula: C8H13
InChI: InChI=1/C8H13/c1-2-4-6-8-7-5-3-1/h1-2,7H,3-6,8H2
21 atoms
C  -1.990158 0.561911 0.10408
H  -2.166255 0.744532 1.168996
C  -1.871696 -0.972793 -0.174767
H  -2.662988 -1.528395 0.335146
C  -0.466775 -1.259927 0.326631
C  0.635016 -1.205495 -0.464569
C  1.926138 -0.682851 0.072405
H  2.066877 -0.94691 1.125825
H  2.794631 -1.038061 -0.491389
C  1.843477 0.871502 -0.079618
H  1.905184 1.138169 -1.141403
H  2.690495 1.350657 0.419554
C  0.514009 1.45584 0.510311
C  -0.636803 1.064214 -0.307721
H  0.530473 -1.298654 -1.546192
H  -1.945343 -1.169653 -1.249171
H  0.376769 1.209238 1.566677
H  -0.51545 1.241889 -1.380657
H  -2.789643 1.026227 -0.484554
H  0.610295 2.556018 0.428523
H  -0.331896 -1.250905 1.409768
totalener: -312.06151288 hartree
nucrepener: 381.60477607 hartree
electener: -693.66628896 hartree
oneelecener: -1164.17477323 hartree
twoeener: 470.50848427 hartree
kineticenergy: 309.63564264 hartree
exchangeener: -34.154698548082 hartree
correlationener: -1.964903308081 hartree
xcener: -36.119601856163 hartree
chargesum: 1.0000000
charge: -0.160678 0.151611 -0.166357 0.153103 -0.094693 -0.119061 -0.175055 0.140767 0.154468 -0.197861 0.138099 0.153902 -0.169048 0.012630 0.180446 0.143901 0.148844 0.199606 0.159382 0.182279 0.163713
charge: 0.087738 0.005388 0.090666 0.000185 0.108872 0.091402 0.072914 0.000534 0.007395 0.105651 -0.005431 0.000675 0.068612 0.315493 -0.009708 0.001501 0.004109 0.011471 0.009185 0.039957 -0.006608
qa: -0.1607 0.1516 -0.1664 0.1531 -0.0947 -0.1191 -0.1751 0.1408 0.1545 -0.1979 0.1381 0.1539 -0.1690 0.0126 0.1804 0.1439 0.1488 0.1996 0.1594 0.1823 0.1637
va: 3.8398 0.9916 3.8767 0.9871 3.8205 3.8282 3.8896 0.9938 0.9879 3.8680 0.9901 0.9852 3.8826 3.6239 0.9833 0.9947 0.9929 0.9749 0.9866 0.9784 0.9932
dispcorr: -0.018915778 hartree
energy: -312.080428661945
dipole: 0.52770 -0.85152 -0.32381 1.90422 -1.17592 0.72830 0.15079 -0.27402 -0.12323
magnitude: 0.80651 au
magnitude: 2.04999 debye
