program: Gaussian 09
title: 000051120
version: EM64L-G09RevD.01
frameworkgroup: C1[X(C12H6Cl2O)]
method: RPBEPBE
basis: SDD
operation: Freq
keyword: #p
keyword: freq=noraman
keyword: PBEPBE/SDD
title: #p freq=noraman PBEPBE/SDD
converged: NO YES YES YES
title: Mulliken charges:
elementType: Cl Cl O C C C C C C C C C C C C H H H H H H
charge: -0.019122 -0.019123 -0.254983 0.363387 0.363385 0.167459 0.167460 -0.316252 -0.316250 -0.368949 -0.368950 -0.253400 -0.253399 -0.208265 -0.208265 0.265345 0.265345 0.256871 0.256870 0.240418 0.240418
chargesum: 0.00000
title: Mulliken charges with hydrogens summed into heavy atoms:
elementType: Cl Cl O C C C C C C C C C C C C
charge: -0.019122 -0.019123 -0.254983 0.363387 0.363385 0.167459 0.167460 -0.316252 -0.316250 -0.103605 -0.103605 0.003470 0.003471 0.032153 0.032153
polarizability: 2.20945646e+02 3.86566404e-05 1.78495365e+02 6.09935243e-03 3.00427538e-03 5.55381003e+01
1716.lowfreq: -8.3683 0.0013 0.0016 0.0022 5.0920 6.7257 32.0157 96.6968 164.6120
frequency: 31.9887 96.6967 164.6120 168.8081 184.9035 199.7789 306.7793 307.3615 343.8672 367.7400 376.1578 465.9157 494.1580 533.5580 546.8948 554.7936 569.4780 570.9650 646.2923 678.6548 708.5613 751.8532 773.7163 781.2537 782.9987 877.4002 885.8288 888.3525 894.6863 964.4894 964.9052 981.0848 1059.5903 1075.3319 1113.9678 1133.1399 1154.6394 1193.9003 1224.7899 1234.8046 1247.8269 1374.5467 1380.4330 1406.2262 1425.0377 1443.4284 1470.2552 1559.2654 1577.0907 1604.2694 1635.7702 3154.4393 3154.5879 3174.1459 3174.2271 3187.6403 3187.8416
redmass: 15.4660 5.4667 18.6019 17.4115 6.1064 4.2132 5.5531 6.5241 7.1704 8.3733 10.5408 8.8219 4.1223 4.9471 7.9511 5.8576 3.7259 5.5020 7.4008 8.6433 3.1475 2.3086 5.9594 1.5021 2.0689 9.6799 1.3639 1.3741 9.4513 1.3242 1.3204 7.5782 1.9647 1.6626 4.7032 1.9385 1.2864 1.6101 3.4203 2.1669 1.9789 5.3565 2.4290 3.4812 6.2864 2.6441 3.4304 6.9587 7.3472 8.3201 8.8490 1.0874 1.0875 1.0933 1.0934 1.0991 1.0992
irintensity: 0.0000 2.9328 1.0485 0.6322 2.9487 0.0000 0.0000 0.0436 0.2385 6.7525 1.0975 5.7527 0.4936 0.0000 3.6782 3.0778 0.0000 1.0457 0.0545 4.8379 36.0724 0.0000 3.9054 141.8947 0.0001 86.0748 0.0000 1.0788 44.0263 0.0000 2.6461 0.0186 0.7912 15.0379 63.1127 18.6046 14.2877 32.7751 0.3639 52.9213 1.8760 38.9797 21.9488 11.4617 60.0094 6.4440 22.1548 6.8707 43.1729 46.5990 1.4792 6.3235 2.0488 4.5930 1.0133 9.3399 2.2984
temp: 298.150 k
press: 1.00000 atm
elementType: 17 17 8 6 6 6 6 6 6 6 6 6 6 6 6 1 1 1 1 1 1
symmnumber: 1
zpe: 372108.8 jmol-1
zpe.correction: 0.141729 hartree
zpe.thermalcorrener: 0.153133 hartree
zpe.thermalcorrenthalpy: 0.154077 hartree
zpe.thermalcorrgfe: 0.103208 hartree
zpe.sumelectzpe: -1455.204258 hartree
zpe.sumelectthermal: -1455.192854 hartree
zpe.sumelectthermalent: -1455.191910 hartree
zpe.sumelectthermalfe: -1455.242779 hartree
dipole: 0.0000 2.4708 0.0001
dipole: 2.4708
quadrupole: -78.8086 -98.4024 -103.7585
quadrupole: 0.0000 0.0019 0.0001
quadrupole: 14.8479 -4.7460 -10.1020 0.0000 0.0019 0.0001
hfenergy: -1455.3459872 hartree
pointgroup: C01 [X(C12H6Cl2O1)]
dipole: -0.0000082 -0.9721017 0.00003 debye
dipolederiv: -0.1049164 0.0439357 0.0000197 -0.0897409 -0.6986721 -0.0002138 -0.0000291 -0.0002277 -0.0420189 -0.1049161 -0.043947 0.0000215 0.08973 -0.6986723 0.0002435 -0.0000336 0.0002529 -0.0420196 -1.2210611 0.0000064 0.0000396 0.0000064 -0.5188373 0.0000101 0.0000314 0.0000114 -0.1511941 0.1106261 0.137154 0.0000418 -0.2579734 -0.3636723 -0.0000835 0.0000596 -0.0000989 0.0312827 0.1106287 -0.1371623 0.0000495 0.2579661 -0.3636744 0.0001022 0.0000399 0.0001148 0.031282 0.63832 0.1728895 -0.0000733 0.5407405 0.3048136 -0.000025 -0.0000675 -0.0000167 0.0862976 0.638308 -0.1728956 -0.0000623 -0.540748 0.3048257 0.0000126 -0.0000377 0.0000065 0.0862981 0.2805761 -0.2013785 -0.0000818 0.2384347 1.0731062 0.0004077 -0.0000058 0.0004184 -0.0611285 0.2805776 0.2013923 -0.0000893 -0.2384186 1.0731064 -0.0004569 0.0000077 -0.0004626 -0.0611281 -0.1782474 -0.1372359 0.0000009 -0.0559389 -0.0100147 -0.0000272 0.0000104 -0.000011 -0.1822999 -0.1782435 0.1372384 -0.0000055 0.0559416 -0.0100186 0.0000162 0.0000086 -0.000003 -0.1823004 -0.1914539 0.2032016 0.0000504 0.1360804 -0.3028568 -0.0000701 0.0000216 -0.0000922 -0.1268629 -0.1914603 -0.2032034 0.0000591 -0.1360846 -0.3028514 0.0000786 0.0000257 0.0001006 -0.1268622 0.0273933 0.0569977 -0.0000163 -0.0640651 0.1923908 0.0000406 -0.0000552 0.0000496 -0.1487705 0.0273928 -0.0569946 -0.0000144 0.0640695 0.1923913 -0.0000587 -0.000061 -0.0000668 -0.1487706 0.0983617 0.0022 0.0000088 0.0354827 -0.030043 -0.0000058 0.0000167 0.0000035 0.1878337 0.0983613 -0.0022017 0.0000087 -0.0354845 -0.0300415 0.0000186 0.0000185 0.0000104 0.1878338 0.0147746 -0.0569324 -0.0000033 -0.0791356 0.0269556 -0.0000175 -0.0000039 -0.0000474 0.167168 0.0147761 0.0569332 -0.0000056 0.079136 0.0269534 0.0000239 -0.0000056 0.0000521 0.1671677 -0.084898 0.0601154 0.0000243 0.0451048 0.0674051 -0.0000178 0.0000274 -0.0000025 0.164096 -0.0848997 -0.0601129 0.0000274 -0.0451032 0.0674063 0.0000226 0.0000319 0.0000085 0.1640959 unknown
polarizability: 220.9456456|-0.0002634|178.495365|-0.0060994|-0.0030042|55.5381003 unknown
InChI: InChI=1S/C12H6Cl2O/c13-7-3-1-5-9-11(7)12-8(14)4-2-6-10(12)15-9/h1-6H
charge 0 multiplicity 1
21 atoms
Cl 1.624672 2.902447 0.000694
Cl -1.624616 2.902475 -0.000851
O  -0.000016 -2.052384 0.000046
C  0.740315 0.18172 -0.000034
C  -0.740308 0.181732 0.000009
C  1.124481 -1.203481 -0.00007
C  -1.124498 -1.203462 0.000113
C  1.826962 1.098322 0.000068
C  -1.826941 1.098352 -0.000149
C  2.433172 -1.696415 -0.000201
C  -2.433197 -1.696376 0.000265
C  3.162633 0.644827 -0.000064
C  -3.162618 0.644879 0.000004
C  3.466609 -0.738084 -0.000235
C  -3.466618 -0.738026 0.000242
H  2.625345 -2.771768 -0.000227
H  -2.625387 -2.771726 0.000356
H  3.968744 1.383502 0.000031
H  -3.968719 1.383567 -0.00012
H  4.513353 -1.056836 -0.000343
H  -4.513367 -1.056764 0.000368
