program: Orca
programVersion: 5.0.3
elementType: C H C H C C C H H C H H C C H H H H H H H
charge: 1
multiplicity: 1
keywords: b3lyp cc-pVTZ EnGrad RIJCOSX verytightscf cc-pVTZ/C def2/J soscf
formula: C8H13
InChI: InChI=1/C8H13/c1-2-4-6-8-7-5-3-1/h1-2,7H,3-6,8H2
21 atoms
C  -1.991165 0.587406 0.089514
H  -2.16856 0.762873 1.156683
C  -1.832512 -0.960106 -0.173051
H  -2.652104 -1.492486 0.31796
C  -0.443579 -1.302087 0.348866
C  0.648875 -1.235297 -0.441924
C  1.943281 -0.695832 0.072492
H  2.106943 -0.943949 1.126307
H  2.811382 -1.035576 -0.502433
C  1.825917 0.853318 -0.099052
H  1.870486 1.112948 -1.163062
H  2.661488 1.361096 0.39102
C  0.487007 1.423442 0.510713
C  -0.679908 1.157611 -0.32039
H  0.525988 -1.269623 -1.526292
H  -1.89257 -1.156109 -1.248495
H  0.339982 1.107199 1.546209
H  -0.581364 1.443553 -1.372565
H  -2.817251 0.998312 -0.500424
H  0.622696 2.524347 0.498666
H  -0.320141 -1.331396 1.432603
totalener: -312.22793638 hartree
nucrepener: 380.39487109 hartree
electener: -692.62280747 hartree
oneelecener: -1161.81232112 hartree
twoeener: 469.18951365 hartree
kineticenergy: 309.97346281 hartree
exchangeener: -36.301084819138 hartree
correlationener: -2.304213084252 hartree
xcener: -38.605297903390 hartree
chargesum: 1.0000000
charge: -0.164094 0.150806 -0.170547 0.152319 -0.099344 -0.112771 -0.174227 0.133760 0.151467 -0.186404 0.131100 0.153802 -0.162713 0.055893 0.159999 0.139550 0.141292 0.203597 0.159970 0.182367 0.154176
charge: 0.095795 0.007458 0.098302 -0.001620 0.095268 0.072545 0.076555 -0.002620 0.005127 0.116073 -0.008780 -0.001441 0.076992 0.336709 -0.015724 -0.001235 0.002757 0.013305 0.008256 0.041962 -0.015684
qa: -0.1641 0.1508 -0.1705 0.1523 -0.0993 -0.1128 -0.1742 0.1338 0.1515 -0.1864 0.1311 0.1538 -0.1627 0.0559 0.1600 0.1396 0.1413 0.2036 0.1600 0.1824 0.1542
va: 3.8105 0.9874 3.8524 0.9811 3.7943 3.8035 3.8638 0.9922 0.9831 3.8281 0.9895 0.9798 3.8548 3.5367 0.9877 0.9907 0.9948 0.9710 0.9827 0.9739 0.9938
energy: -312.227936384836
dipole: 0.47501 -0.88028 -0.40527 1.94834 -0.96371 0.98463 0.14615 -0.26791 -0.12176
magnitude: 1.07171 au
magnitude: 2.72408 debye
