program: Orca
programVersion: 5.0.3
elementType: C H C H C C C H H C H H C C H H H H H H H
charge: 1
multiplicity: 1
keywords: b3lyp cc-pVTZ EnGrad RIJCOSX verytightscf cc-pVTZ/C def2/J soscf
formula: C8H13
InChI: InChI=1/C8H13/c1-2-4-6-8-7-5-3-1/h1-2,7H,3-6,8H2
21 atoms
C  -2.00118 0.75511 0.069179
H  -2.163172 0.81911 1.147818
C  -1.730073 -0.973257 -0.162881
H  -2.618976 -1.328141 0.36287
C  -0.412901 -1.387169 0.389835
C  0.683431 -1.272793 -0.38345
C  1.998516 -0.696317 0.062614
H  2.203862 -0.900836 1.118857
H  2.854354 -1.036047 -0.527094
C  1.787734 0.846095 -0.13587
H  1.823372 1.10961 -1.198734
H  2.591938 1.396736 0.359276
C  0.423757 1.27787 0.494742
C  -0.766865 1.294418 -0.364447
H  0.518349 -1.193878 -1.462709
H  -1.830568 -1.132495 -1.237054
H  0.208968 0.687276 1.389177
H  -0.659236 1.623987 -1.401574
H  -2.882936 0.997013 -0.522556
H  0.495739 2.323581 0.866332
H  -0.328891 -1.478056 1.472022
totalener: -312.21065347 hartree
nucrepener: 379.26048563 hartree
electener: -691.47113910 hartree
oneelecener: -1159.58235861 hartree
twoeener: 468.11121951 hartree
kineticenergy: 309.98990566 hartree
exchangeener: -36.296621709205 hartree
correlationener: -2.303385430539 hartree
xcener: -38.600007139744 hartree
chargesum: 1.0000000
charge: -0.201206 0.170522 -0.185620 0.174026 -0.123700 -0.088792 -0.169266 0.127081 0.145183 -0.199830 0.130954 0.149648 -0.175573 0.104801 0.132876 0.163447 0.133475 0.203759 0.175064 0.185733 0.147419
charge: 0.135917 0.012287 0.177893 0.005330 0.023919 0.071936 0.077088 -0.005237 -0.003642 0.109330 -0.012415 -0.001901 0.083407 0.299743 -0.018000 -0.002651 0.005915 0.015475 0.004113 0.045950 -0.024458
qa: -0.2012 0.1705 -0.1856 0.1740 -0.1237 -0.0888 -0.1693 0.1271 0.1452 -0.1998 0.1310 0.1496 -0.1756 0.1048 0.1329 0.1634 0.1335 0.2038 0.1751 0.1857 0.1474
va: 3.8305 0.9811 3.8505 0.9725 3.7829 3.8044 3.8543 0.9935 0.9839 3.8420 0.9903 0.9807 3.8466 3.5422 0.9937 0.9811 1.0066 0.9707 0.9810 0.9726 0.9951
energy: -312.210653468814
dipole: 0.19927 -1.04760 -0.84833 1.76794 -0.63722 1.13071 0.34331 -0.46681 -0.12350
magnitude: 1.41895 au
magnitude: 3.60669 debye
