program: Gaussian 09
title: 000051122
version: EM64L-G09RevD.01
frameworkgroup: C1[X(C12H4Cl4O)]
method: RPBEPBE
basis: SDD
operation: Freq
keyword: #p
keyword: freq=noraman
keyword: PBEPBE/SDD
title: #p freq=noraman PBEPBE/SDD
converged: NO NO NO NO
title: Mulliken charges:
elementType: Cl Cl Cl Cl O C C C C C C C C C C C C H H H H
charge: -0.017878 0.049933 0.010831 -0.035928 -0.240176 0.417236 0.230330 0.354678 0.187386 -0.353091 -0.364012 -0.316208 -0.325831 -0.277491 -0.103923 -0.219287 -0.097370 0.270466 0.288243 0.282245 0.259844
chargesum: 0.00000
title: Mulliken charges with hydrogens summed into heavy atoms:
elementType: Cl Cl Cl Cl O C C C C C C C C C C C C
charge: -0.017878 0.049933 0.010831 -0.035928 -0.240176 0.417236 0.230330 0.354678 0.187386 -0.353091 -0.093546 -0.316208 -0.037588 0.004754 -0.103923 0.040557 -0.097370
polarizability: 3.03215476e+02 1.97265765e+00 1.87305393e+02 3.95106140e-03 1.18620765e-02 6.00652931e+01
1716.lowfreq: -0.0009 0.0014 0.0015 4.5278 5.0097 8.1043 46.6313 75.8147 94.0161
frequency: 46.6297 75.8085 94.0079 99.1050 139.5308 166.6297 178.7302 215.6235 229.4167 260.0634 272.1427 315.3195 334.6051 366.4139 373.6203 392.0233 438.5189 502.7242 555.8508 560.9964 573.8510 578.1366 606.1244 622.6134 696.6630 718.0060 732.6666 758.2969 825.6441 831.8335 850.1395 860.6154 865.1743 915.1315 958.8120 1012.4486 1050.7535 1113.6195 1149.7052 1169.5721 1180.7135 1236.7974 1279.5172 1314.5686 1382.4327 1405.8129 1417.5145 1426.5548 1460.4436 1560.3915 1589.7273 1597.7407 1630.9563 3168.4464 3183.3472 3187.0022 3190.8826
redmass: 21.7705 16.2447 6.0785 21.6721 10.3111 23.7911 30.2068 6.6046 12.2475 18.7169 7.7425 25.5120 7.4549 7.6377 8.2477 12.8220 3.1762 9.3166 4.9942 7.5568 9.4579 6.4398 6.2117 7.1626 7.7700 5.6634 11.2011 5.1672 1.4613 7.8715 1.3970 8.9615 1.4161 11.0556 1.3417 8.3402 1.8473 2.6775 1.7315 2.3249 5.5799 1.6222 2.4198 6.2006 5.6574 5.3331 4.4301 4.5665 3.9082 9.6375 9.0091 9.7875 9.4887 1.0889 1.0928 1.0970 1.0947
irintensity: 0.0103 0.1337 0.4039 0.0309 0.0416 0.2433 0.0508 0.6069 0.9077 0.5246 0.0156 0.3845 0.6439 0.3862 0.0470 21.5654 11.0483 15.1801 4.7723 2.4016 6.3708 7.8787 4.9429 0.6919 10.3062 0.6722 20.6843 3.6453 40.2130 42.0364 22.2409 33.7786 29.0288 179.8352 0.5868 29.6032 29.2501 11.2924 66.8947 2.9333 7.2923 10.3195 21.6678 52.9356 51.9900 57.1068 11.3943 121.3548 14.2799 3.7096 22.5146 111.0118 11.9488 0.2628 1.7099 1.3043 1.7787
temp: 298.150 k
press: 1.00000 atm
elementType: 17 17 17 17 8 6 6 6 6 6 6 6 6 6 6 6 6 1 1 1 1
symmnumber: 1
zpe: 321319.4 jmol-1
zpe.correction: 0.122384 hartree
zpe.thermalcorrener: 0.136536 hartree
zpe.thermalcorrenthalpy: 0.137480 hartree
zpe.thermalcorrgfe: 0.079884 hartree
zpe.sumelectzpe: -2373.980822 hartree
zpe.sumelectthermal: -2373.966670 hartree
zpe.sumelectthermalent: -2373.965726 hartree
zpe.sumelectthermalfe: -2374.023322 hartree
dipole: 0.4772 1.7544 0.0002
dipole: 1.8182
quadrupole: -128.3943 -121.1223 -126.6383
quadrupole: -0.1940 0.0005 0.0004
quadrupole: -3.0093 4.2627 -1.2533 -0.1940 0.0005 0.0004
hfenergy: -2374.1032064 hartree
pointgroup: C01 [X(C12H4Cl4O1)]
dipole: 0.1770177 0.6930782 0.0000642 debye
dipolederiv: -0.1428828 -0.1635771 -0.0000263 -0.0398849 -0.7176049 -0.0000933 -0.0000017 -0.0000829 -0.035909 -0.0833384 -0.1421582 -0.0000107 -0.2609957 -0.5947097 -0.0000449 -0.0000294 -0.0000591 0.0179406 -0.8622983 -0.1195039 -0.00007 -0.1392726 -0.0782751 -0.0000144 -0.0000912 -0.0000169 -0.0181047 -0.9487299 0.1907229 0.0000294 0.2721025 -0.1736033 -0.0000151 0.0000246 -0.0000104 -0.0549514 -1.2812847 0.0413031 0.0000034 0.0661246 -0.4201245 -0.0000164 0.0000162 0.0000078 -0.1406251 0.1985203 -0.2229533 -0.0000333 0.2663447 -0.3529357 -0.0000451 -0.0000284 -0.000044 0.0248298 0.0197342 0.1058671 0.000003 -0.2360178 -0.1501544 -0.0000074 -0.0000109 -0.0000153 0.0062087 0.5557184 -0.187238 0.0000067 -0.7393453 0.092886 -0.0000031 -0.0000219 -0.0000243 0.140896 0.7970546 0.152606 -0.0000111 0.4709184 0.2520299 0.0000059 0.0000079 0.0000043 0.0799197 0.3431033 0.3027614 0.0000622 -0.0571574 1.1052235 0.0001684 0.0000341 0.0001559 -0.0732403 0.2500775 -0.0884253 -0.0000077 0.1341927 0.0757853 0.0000162 0.000015 0.00002 -0.1274727 -0.1529972 0.3213114 0.0000011 0.3895703 0.8921939 0.0000582 0.0000116 0.000094 -0.0964634 -0.4680508 -0.0504572 0.0000066 -0.0398572 -0.0486657 0.000004 0.0000006 -0.0000036 -0.1191499 -0.4551028 -0.1470143 -0.000042 -0.2155635 -0.3175193 -0.0000462 -0.0000574 -0.0000348 -0.0616945 1.1261695 0.0447779 0.0001169 0.2752216 0.0875037 0.00004 0.0001636 0.0000291 -0.0499042 -0.4355446 0.1975648 0.0000312 0.3357763 -0.1349482 0.0000027 0.0000627 0.0000099 -0.1156594 1.2796136 -0.25385 -0.0000494 -0.4814498 0.3544998 0.0000377 -0.000067 0.0000371 -0.0734973 0.0985996 0.0499653 0.0000034 0.010815 -0.0085972 -0.0000138 -0.0000059 -0.0000231 0.1635785 0.1027342 0.0046092 0.0000018 0.020001 0.0360503 -0.000009 0.0000061 -0.0000083 0.1909583 0.0594201 0.0266043 -0.0000038 0.0268666 0.0525626 -0.0000104 -0.0000135 -0.0000184 0.1728785 -0.0005156 -0.0629163 -0.0000112 -0.0583893 0.0484029 -0.0000138 -0.0000151 -0.0000172 0.1694618 unknown
polarizability: 303.1263157|3.7706781|187.3945535|0.0037665|0.011922|60.0652931 unknown
InChI: InChI=1S/C12H4Cl4O/c13-5-1-2-6-9(3-5)17-12-10(6)7(14)4-8(15)11(12)16/h1-4H
charge 0 multiplicity 1
21 atoms
Cl -0.958363 3.383948 0.000444
Cl -2.723062 -2.837413 -0.000192
Cl -4.974207 -0.419362 -0.000276
Cl 5.392413 -0.881193 -0.000111
O  0.174747 -1.632069 -0.000031
C  -0.456713 0.626562 0.000108
C  1.002789 0.568945 0.000077
C  -0.907634 -0.729581 -0.000015
C  1.338229 -0.818261 -0.00002
C  -1.440629 1.636165 0.000206
C  2.052945 1.51779 0.000117
C  -2.259342 -1.102309 -0.000058
C  2.645628 -1.314874 -0.000076
C  -2.80785 1.309126 0.000093
C  -3.204807 -0.051503 -0.000064
C  3.386927 1.057101 0.000111
C  3.658517 -0.334508 -0.00003
H  1.843479 2.590115 0.000202
H  2.862468 -2.384996 -0.000134
H  -3.569468 2.092541 0.000123
H  4.218031 1.767475 0.000226
