program: Orca
programVersion: 5.0.3
elementType: C H C H C C C H H C H H C C H H H H H H H
charge: 1
multiplicity: 1
keywords: DSD-PBEP86 def2-TZVP D3BJ RIJCOSX verytightscf def2-TZVP/C def2/J soscf noTRAH
formula: C8H13
InChI: InChI=1/C8H13/c1-2-4-6-8-7-5-3-1/h1-2,7H,3-6,8H2
21 atoms
C  -1.994473 0.540228 0.117958
H  -2.170257 0.72845 1.180887
C  -1.924098 -0.987495 -0.173652
H  -2.672393 -1.56923 0.368458
C  -0.498485 -1.189205 0.296911
C  0.619555 -1.156466 -0.491149
C  1.912249 -0.664121 0.069294
H  2.025566 -0.950893 1.120178
H  2.775094 -1.041927 -0.48669
C  1.873076 0.89736 -0.051825
H  1.970783 1.178588 -1.107215
H  2.724583 1.336516 0.475039
C  0.54327 1.478854 0.499424
C  -0.580879 0.916959 -0.282132
H  0.533579 -1.308472 -1.566842
H  -2.022688 -1.188092 -1.244943
H  0.418277 1.316486 1.574441
H  -0.445647 0.990663 -1.36431
H  -2.747367 1.072922 -0.473464
H  0.562109 2.570046 0.330664
H  -0.352809 -1.14516 1.377821
totalener: -311.14754143 hartree
nucrepener: 383.88246377 hartree
electener: -695.03000520 hartree
oneelecener: -1168.08093283 hartree
twoeener: 473.05092763 hartree
kineticenergy: 310.01987249 hartree
exchangeener: -13.672133496469 hartree
correlationener: -0.925132901427 hartree
xcener: -14.597266397896 hartree
chargesum: 1.0000000
charge: -0.205387 0.166020 -0.201731 0.177579 -0.096381 -0.099111 -0.222635 0.157032 0.173047 -0.234599 0.150384 0.173730 -0.200476 0.018096 0.192459 0.160678 0.155686 0.193842 0.178162 0.189232 0.174374
charge: -0.196198 0.154366 -0.191599 0.149793 -0.066927 -0.060492 -0.211386 0.152915 0.155844 -0.205259 0.145973 0.150426 -0.222727 0.104794 0.161181 0.152364 0.153773 0.171801 0.155266 0.180733 0.165357
qa: -0.2054 0.1660 -0.2017 0.1776 -0.0964 -0.0991 -0.2226 0.1570 0.1730 -0.2346 0.1504 0.1737 -0.2005 0.0181 0.1925 0.1607 0.1557 0.1938 0.1782 0.1892 0.1744
va: 3.8604 0.9723 3.8586 0.9715 3.8508 3.8393 3.9021 0.9701 0.9694 3.8656 0.9718 0.9653 3.9113 3.6480 0.9529 0.9743 0.9723 0.9489 0.9700 0.9627 0.9618
total: -311.820916527 hartree
dispcorr: -0.011920630 hartree
energy: -311.832837157159
dipole: 0.56118 -0.86693 -0.30576 1.86270 -1.45096 0.41174 0.17228 -0.34522 -0.17294
magnitude: 0.54123 au
magnitude: 1.37569 debye
