program: Orca
programVersion: 5.0.3
elementType: C H C H C C C H H C H H C C H H H H H H H
charge: 1
multiplicity: 1
keywords: m062x def2-TZVP EnGrad RIJCOSX verytightscf def2/J soscf
formula: C8H13
InChI: InChI=1/C8H13/c1-2-4-6-8-7-5-3-1/h1-2,7H,3-6,8H2
21 atoms
C  -2.002607 0.722585 0.080804
H  -2.206275 0.874309 1.144616
C  -1.76289 -0.928799 -0.143872
H  -2.619196 -1.366557 0.373914
C  -0.429752 -1.356097 0.409155
C  0.697827 -1.284529 -0.364014
C  2.00908 -0.687027 0.070879
H  2.222681 -0.879509 1.127658
H  2.859253 -1.021267 -0.527607
C  1.802009 0.898191 -0.143812
H  1.861146 1.132721 -1.211785
H  2.616406 1.42517 0.357158
C  0.425227 1.273029 0.436698
C  -0.741591 1.319262 -0.369844
H  0.530673 -1.208028 -1.443027
H  -1.851279 -1.127632 -1.214413
H  0.070723 0.187981 0.722475
H  -0.600479 1.336402 -1.454927
H  -2.868523 0.993095 -0.52449
H  0.364598 1.68801 1.450572
H  -0.347537 -1.517215 1.486248
totalener: -312.24138687 hartree
nucrepener: 381.40577174 hartree
electener: -693.64715862 hartree
oneelecener: -1163.36204967 hartree
twoeener: 469.71489106 hartree
kineticenergy: 310.34675330 hartree
xcener: -23.093869813124 hartree
chargesum: 1.0000000
charge: -0.308039 0.216380 -0.349934 0.212628 -0.115085 -0.111280 -0.306137 0.201786 0.199574 -0.369472 0.209988 0.202646 -0.120681 0.015970 0.180247 0.217126 0.119796 0.212094 0.212370 0.253884 0.226137
charge: -0.188465 0.162860 -0.174413 0.163871 -0.196047 -0.090207 -0.215369 0.155790 0.155791 -0.203803 0.152848 0.157685 -0.204260 0.042615 0.160303 0.156752 0.278550 0.171504 0.163321 0.187617 0.163059
qa: -0.3080 0.2164 -0.3499 0.2126 -0.1151 -0.1113 -0.3061 0.2018 0.1996 -0.3695 0.2100 0.2026 -0.1207 0.0160 0.1802 0.2171 0.1198 0.2121 0.2124 0.2539 0.2261
va: 3.7151 0.9453 3.7975 0.9523 3.4868 3.7627 3.7137 0.9496 0.9586 3.7973 0.9437 0.9602 3.4793 3.6378 0.9524 0.9417 1.0164 0.9416 0.9545 0.9355 0.9408
energy: -312.241386874596
dipole: 0.03019 -0.46967 -0.43947 0.48543 0.10070 0.58613 0.26865 -0.30548 -0.03683
magnitude: 0.73351 au
magnitude: 1.86444 debye
