program: Orca
programVersion: 5.0.3
elementType: C H C H C C C H H C H H C C H H H H H H H
charge: 1
multiplicity: 1
keywords: m062x def2-TZVP EnGrad RIJCOSX verytightscf def2/J soscf
formula: C8H13
InChI: InChI=1/C8H13/c1-2-4-6-8-7-5-3-1/h1-2,7H,3-6,8H2
21 atoms
C  -1.999102 0.737779 0.077133
H  -2.192108 0.864337 1.145949
C  -1.749139 -0.93862 -0.147014
H  -2.618374 -1.342128 0.377505
C  -0.426909 -1.367605 0.404225
C  0.694747 -1.284278 -0.366506
C  2.007014 -0.687414 0.067704
H  2.219732 -0.878173 1.12531
H  2.858732 -1.025512 -0.527113
C  1.798388 0.889458 -0.145057
H  1.855826 1.131209 -1.21157
H  2.609713 1.422924 0.355069
C  0.423052 1.259842 0.452095
C  -0.754079 1.318266 -0.376505
H  0.529915 -1.212889 -1.446154
H  -1.845427 -1.124196 -1.218171
H  0.110966 0.288361 0.937232
H  -0.626384 1.40657 -1.459339
H  -2.872214 0.986579 -0.526425
H  0.388353 1.865747 1.370644
H  -0.346493 -1.514778 1.483002
totalener: -312.24579727 hartree
nucrepener: 380.70153894 hartree
electener: -692.94733622 hartree
oneelecener: -1162.07275234 hartree
twoeener: 469.12541612 hartree
kineticenergy: 310.36133047 hartree
xcener: -23.091339256023 hartree
chargesum: 1.0000000
charge: -0.321463 0.225251 -0.324444 0.214962 -0.162196 -0.113406 -0.318749 0.202141 0.196693 -0.350492 0.204745 0.198645 -0.206671 0.076105 0.178506 0.218698 0.166734 0.220662 0.215226 0.260256 0.218795
charge: -0.178366 0.167276 -0.153514 0.165602 -0.200478 -0.105512 -0.218740 0.154851 0.154176 -0.207030 0.150383 0.157000 -0.217894 0.084332 0.157568 0.157817 0.241073 0.172790 0.164541 0.195683 0.158443
qa: -0.3215 0.2253 -0.3244 0.2150 -0.1622 -0.1134 -0.3187 0.2021 0.1967 -0.3505 0.2047 0.1986 -0.2067 0.0761 0.1785 0.2187 0.1667 0.2207 0.2152 0.2603 0.2188
va: 3.7297 0.9415 3.7606 0.9492 3.5529 3.7219 3.7228 0.9486 0.9612 3.7622 0.9460 0.9605 3.5782 3.5215 0.9528 0.9407 0.9905 0.9396 0.9548 0.9312 0.9417
energy: -312.245797272833
dipole: 0.06772 -0.74673 -0.67900 0.81401 0.02825 0.84226 0.38065 -0.43396 -0.05331
magnitude: 1.08318 au
magnitude: 2.75323 debye
