program: Gaussian 09
title: 000051114
version: EM64L-G09RevD.01
frameworkgroup: C1[X(C4H8N2OS)]
method: RPBEPBE
basis: SDD
operation: Freq
keyword: #p
keyword: freq=noraman
keyword: PBEPBE/SDD
title: #p freq=noraman PBEPBE/SDD
converged: YES YES NO NO
title: Mulliken charges:
elementType: S O N N C C C C H H H H H H H H
charge: 0.199066 -0.275788 -0.073532 0.050592 -0.388850 -0.304639 -0.699026 -0.594731 0.301356 0.269206 0.262903 0.275180 0.278245 0.237742 0.226550 0.235727
chargesum: 0.00000
title: Mulliken charges with hydrogens summed into heavy atoms:
elementType: S O N N C C C C
charge: 0.199066 -0.275788 -0.073532 0.050592 -0.087494 0.227470 -0.145602 0.105288
polarizability: 9.46658164e+01 -7.81896007e-01 7.70789430e+01 -1.32833933e+00 -5.52729390e+00 5.80983804e+01
1716.lowfreq: -0.0021 -0.0012 0.0023 6.6989 12.3478 14.9332 47.7728 148.4140 163.3107
frequency: 46.5295 148.3631 163.2992 221.4676 240.3372 284.7159 360.5931 407.6076 438.5340 493.7734 637.5344 661.5583 688.9966 769.7303 842.1084 981.8387 997.0599 1012.6987 1032.9787 1070.9746 1099.6635 1145.8499 1173.9699 1198.9690 1228.1365 1262.1460 1297.2034 1321.2889 1345.5306 1388.6204 1453.9196 1460.8541 1466.3825 1471.9004 2988.5950 3005.6285 3044.7766 3060.9565 3072.6771 3089.8366 3105.4354 3126.8232
redmass: 4.7470 3.7177 2.0915 2.1104 1.4963 3.9028 6.5002 8.2584 4.4799 4.0503 4.5176 3.7107 3.4519 3.6057 1.6249 1.7844 1.4793 2.0957 1.5143 3.7553 2.7056 1.6565 1.2903 1.6917 2.0319 1.2416 2.1897 1.4433 2.2700 1.2095 1.0755 1.0516 1.0552 1.0815 1.0356 1.0586 1.0668 1.0963 1.0892 1.0981 1.0994 1.1077
irintensity: 5.7800 1.9045 1.2580 4.1503 1.5128 2.0958 0.4058 4.2520 9.9819 2.5670 1.9852 8.9996 9.4579 13.8960 6.6717 14.9442 7.7772 34.2896 21.4179 104.2419 50.7964 3.1731 2.8901 48.6837 42.1546 9.1473 91.7407 4.5848 24.9344 16.6515 3.1762 15.3397 15.0003 7.1538 14.1871 7.5965 16.3136 17.2904 2.0373 15.0203 23.1700 8.9675
temp: 298.150 k
press: 1.00000 atm
elementType: 16 8 7 7 6 6 6 6 1 1 1 1 1 1 1 1
symmnumber: 1
zpe: 324845.1 jmol-1
zpe.correction: 0.123727 hartree
zpe.thermalcorrener: 0.132175 hartree
zpe.thermalcorrenthalpy: 0.133119 hartree
zpe.thermalcorrgfe: 0.090034 hartree
zpe.sumelectzpe: -739.304922 hartree
zpe.sumelectthermal: -739.296474 hartree
zpe.sumelectthermalent: -739.295530 hartree
zpe.sumelectthermalfe: -739.338615 hartree
dipole: 3.2884 -0.4862 1.9778
dipole: 3.8680
quadrupole: -71.6363 -48.9346 -53.9621
quadrupole: 0.7786 0.0043 -1.7760
quadrupole: -13.4586 9.2430 4.2156 0.7786 0.0043 -1.7760
hfenergy: -739.4286487 hartree
pointgroup: C01 [X(C4H8N2O1S1)]
dipole: -1.2509784 -0.0758346 0.8632441 debye
dipolederiv: -0.2650544 0.0298689 0.0194873 -0.022382 -0.2590422 0.0299185 0.0193674 0.0595866 -0.1256411 -0.8782883 -0.0844161 0.1806243 -0.8200712 -0.4647737 0.1555391 -0.0589528 -0.0743381 -0.2079858 -1.0469893 -0.2694345 0.1522545 0.0567411 -0.292901 0.0583063 0.3838588 0.2070771 -0.2677204 1.3946152 0.3218761 -0.3909563 0.5692929 0.0961779 -0.0849818 -0.376185 -0.0472104 0.01885 0.5985642 0.0114439 0.0380492 0.1132185 0.5568023 -0.1867908 0.0847938 -0.1573406 0.250288 0.0584359 -0.0488729 0.0477795 -0.0104534 0.1620387 -0.0746779 -0.0205199 -0.125846 0.1979059 0.0569682 0.031756 0.0182204 0.0806198 0.1933958 0.0826745 -0.0070507 0.0657358 0.2075638 -0.1099686 0.0450091 -0.0301438 -0.0360358 -0.0795166 0.1019575 -0.0301773 0.0959048 -0.0579964 0.0390758 0.0461986 0.0511883 -0.0129531 0.004927 -0.0177351 0.0002441 -0.0304557 -0.0195935 0.0457041 -0.0248781 0.033027 0.0239367 0.0024036 0.0376452 0.0269143 0.0929547 -0.0041466 -0.0101419 -0.0577878 -0.0797431 0.0078223 0.0583432 -0.0313566 -0.0211012 -0.0448621 -0.0311319 0.0472448 -0.0510113 -0.0279364 -0.0548706 0.0368571 0.0224104 0.0389439 -0.0172367 -0.1463179 0.0403319 0.0513702 -0.0080107 0.0868798 -0.0493999 -0.0106375 -0.0139267 0.0042067 0.0907119 -0.0666845 0.1100963 -0.0328532 0.094544 0.0313632 0.0437394 -0.0347196 0.0575874 0.073172 0.0922439 0.0165692 0.0564485 0.0441111 0.0322342 -0.1263587 0.0327646 -0.060735 -0.0524729 0.0039428 -0.1277876 -0.0274354 -0.1204002 -0.0289096 0.0003475 -0.0242538 -0.0250284 0.0745149 unknown
polarizability: 93.93672|3.506786|78.0964371|-2.4138833|4.6180075|57.8099826 unknown
InChI: InChI=1S/C4H8N2OS/c1-4-6(5-7)2-3-8-4/h4H,2-3H2,1H3
charge 0 multiplicity 1
16 atoms
S  -2.110207 -0.098777 -0.86731
O  2.528156 0.948546 -0.713075
N  0.503403 0.07555 -0.371316
N  1.778962 -0.093732 -0.861754
C  -0.465958 -1.023194 -0.583299
C  -0.002332 1.383158 0.127406
C  -1.515125 1.223639 0.366285
C  -0.535352 -1.999285 0.598735
H  -0.206803 -1.540783 -1.520585
H  0.22647 2.146856 -0.639344
H  0.53582 1.673158 1.048035
H  -1.742778 0.886533 1.38955
H  -2.066056 2.15133 0.152133
H  0.452706 -2.47046 0.754466
H  -0.829367 -1.484006 1.529638
H  -1.277039 -2.789733 0.392635
