program: Orca
programVersion: 5.0.3
charge: 1
multiplicity: 1
keywords: DLPNO-CCSD(T1) tightPNO Extrapolate(3/4,def2) RIJK def2/JK verytightSCF miniprint nopop
formula: C8H13
InChI: InChI=1/C8H13/c1-2-4-6-8-7-5-3-1/h1-2,7H,3-6,8H2
21 atoms
C  -1.997068 0.531378 0.120048
H  -2.174447 0.723357 1.18181
C  -1.950467 -0.995568 -0.171029
H  -2.675345 -1.587052 0.390743
C  -0.51469 -1.148184 0.284325
C  0.611875 -1.129137 -0.501871
C  1.907957 -0.653926 0.065829
H  2.010142 -0.952114 1.114664
H  2.764575 -1.044316 -0.490401
C  1.891057 0.910553 -0.038479
H  2.01188 1.201212 -1.088721
H  2.73957 1.329086 0.509212
C  0.555208 1.481576 0.491797
C  -0.553791 0.840107 -0.26694
H  0.5316 -1.302295 -1.574635
H  -2.062739 -1.203081 -1.239342
H  0.437385 1.353161 1.572587
H  -0.425437 0.902643 -1.35049
H  -2.721902 1.094447 -0.476836
H  0.530504 2.564107 0.284922
H  -0.365353 -1.097432 1.36419
e0: -310.324090671 hartree
corrType: DLPNO BASED
e0: -310.337682701 hartree
basis: def2-TZVPP def2-QZVPP
scfener: -310.324090671 -310.337682701
corrmethod: MDCI MDCI
correner: -1.451973322 -1.522117082
corrcbsextra: -1.574075384
energy: -311.913630233358
dipole: 0.56268 -0.81142 -0.24874 1.85503 -1.65778 0.19725 0.18512 -0.38585 -0.20073
magnitude: 0.37560 au
magnitude: 0.95469 debye
