program: Orca
programVersion: 5.0.3
elementType: C H C H C C C H H C H H C C H H H H H H H
charge: 1
multiplicity: 1
keywords: b3lyp def2-TZVP EnGrad D3BJ RIJCOSX verytightscf def2/J soscf
formula: C8H13
InChI: InChI=1/C8H13/c1-2-4-6-8-7-5-3-1/h1-2,7H,3-6,8H2
21 atoms
C  -2.00569 0.708869 0.084303
H  -2.216339 0.879682 1.144025
C  -1.777025 -0.922827 -0.140966
H  -2.621346 -1.388964 0.370877
C  -0.4327 -1.346481 0.411233
C  0.699271 -1.28315 -0.362555
C  2.010372 -0.686021 0.074382
H  2.224813 -0.881369 1.130032
H  2.858828 -1.017407 -0.527564
C  1.805244 0.90479 -0.141631
H  1.865704 1.133904 -1.210621
H  2.621396 1.426603 0.361394
C  0.428886 1.287065 0.425601
C  -0.728748 1.315098 -0.362575
H  0.5308 -1.203934 -1.441154
H  -1.858269 -1.130196 -1.211495
H  0.037386 0.109843 0.524836
H  -0.578028 1.292604 -1.446379
H  -2.865018 0.999397 -0.521566
H  0.351175 1.553204 1.484301
H  -0.346467 -1.503582 1.488667
totalener: -312.18362502 hartree
nucrepener: 382.01747922 hartree
electener: -694.20110425 hartree
oneelecener: -1164.73690189 hartree
twoeener: 470.53579764 hartree
kineticenergy: 310.48967453 hartree
exchangeener: -36.312487702722 hartree
correlationener: -2.307830851866 hartree
xcener: -38.620318554588 hartree
chargesum: 1.0000000
charge: -0.204028 0.159470 -0.270053 0.175116 -0.065221 -0.035825 -0.201157 0.151313 0.165896 -0.283211 0.162336 0.169952 -0.025051 0.009028 0.139673 0.167295 0.072225 0.161449 0.174333 0.196779 0.179684
charge: -0.188513 0.155900 -0.181643 0.159398 -0.175953 -0.072323 -0.203288 0.152619 0.154537 -0.193792 0.150954 0.155624 -0.177048 -0.005241 0.159801 0.152503 0.295182 0.166103 0.158870 0.174211 0.162100
qa: -0.2040 0.1595 -0.2701 0.1751 -0.0652 -0.0358 -0.2012 0.1513 0.1659 -0.2832 0.1623 0.1700 -0.0251 0.0090 0.1397 0.1673 0.0722 0.1614 0.1743 0.1968 0.1797
va: 3.8357 0.9691 3.9441 0.9656 3.6476 3.8659 3.8414 0.9699 0.9679 3.9505 0.9635 0.9697 3.5805 3.8296 0.9664 0.9635 1.0657 0.9601 0.9653 0.9557 0.9611
dispcorr: -0.037282443 hartree
energy: -312.220907464906
dipole: 0.00435 -0.22309 -0.21874 0.25313 0.05989 0.31302 0.13638 -0.16253 -0.02615
magnitude: 0.38277 au
magnitude: 0.97292 debye
