program: Orca
programVersion: 5.0.3
elementType: C H C H C C C H H C H H C C H H H H H H H
charge: 1
multiplicity: 1
keywords: b3lyp cc-pVTZ EnGrad D3BJ RIJCOSX verytightscf cc-pVTZ/C def2/J soscf
formula: C8H13
InChI: InChI=1/C8H13/c1-2-4-6-8-7-5-3-1/h1-2,7H,3-6,8H2
21 atoms
C  -2.000157 0.732838 0.078316
H  -2.197069 0.868024 1.14546
C  -1.753407 -0.935073 -0.14592
H  -2.618518 -1.349843 0.376564
C  -0.427892 -1.363842 0.405978
C  0.695865 -1.284575 -0.365582
C  2.007727 -0.687289 0.068677
H  2.220766 -0.878427 1.126072
H  2.858986 -1.024113 -0.527293
C  1.799635 0.892579 -0.1448
H  1.857818 1.131814 -1.211819
H  2.61208 1.423856 0.355455
C  0.423609 1.263651 0.446722
C  -0.750279 1.31919 -0.37463
H  0.530346 -1.211791 -1.445044
H  -1.847233 -1.125297 -1.216804
H  0.098031 0.254488 0.868852
H  -0.618164 1.381657 -1.458882
H  -2.870932 0.988427 -0.52605
H  0.379561 1.805214 1.402803
H  -0.347041 -1.516874 1.484128
totalener: -312.18434184 hartree
nucrepener: 380.92946520 hartree
electener: -693.11380703 hartree
oneelecener: -1162.71890263 hartree
twoeener: 469.60509560 hartree
kineticenergy: 309.95537755 hartree
exchangeener: -36.290469386423 hartree
correlationener: -2.306131702441 hartree
xcener: -38.596601088864 hartree
chargesum: 1.0000000
charge: -0.191843 0.157250 -0.207603 0.169208 -0.108058 -0.062031 -0.181761 0.133070 0.151404 -0.207491 0.137456 0.153423 -0.149017 0.081505 0.142362 0.155268 0.128332 0.178807 0.172578 0.189546 0.157596
charge: 0.122499 0.005055 0.143334 0.006472 0.041473 0.111231 0.089150 -0.005321 -0.003581 0.115451 -0.011250 -0.002536 0.093533 0.268782 -0.013424 -0.004316 0.010341 0.007626 0.005800 0.032301 -0.012617
qa: -0.1918 0.1573 -0.2076 0.1692 -0.1081 -0.0620 -0.1818 0.1331 0.1514 -0.2075 0.1375 0.1534 -0.1490 0.0815 0.1424 0.1553 0.1283 0.1788 0.1726 0.1895 0.1576
va: 3.8340 0.9853 3.8791 0.9760 3.7861 3.7905 3.8482 0.9918 0.9811 3.8613 0.9901 0.9836 3.7938 3.6146 0.9904 0.9845 1.0505 0.9806 0.9782 0.9827 0.9937
dispcorr: -0.037190346 hartree
energy: -312.221532180893
dipole: 0.05498 -0.62184 -0.56687 0.70070 -0.02218 0.67852 0.35022 -0.38214 -0.03192
magnitude: 0.88473 au
magnitude: 2.24880 debye
