program: Gaussian 09
title: 000051118
version: EM64L-G09RevD.01
frameworkgroup: C1[X(C11H20N3O3P)]
method: RPBEPBE
basis: SDD
operation: Freq
keyword: #p
keyword: freq=noraman
keyword: PBEPBE/SDD
title: #p freq=noraman PBEPBE/SDD
converged: YES YES NO NO
title: Mulliken charges:
elementType: P O O O N N N C C C C C C C C C C C H H H H H H H H H H H H H H H H H H H H
charge: 1.272979 -0.575944 -0.303360 -0.290826 -0.467096 -0.420704 -0.764577 -0.366447 -0.419085 -0.392975 -0.385260 0.044575 -0.443366 -0.429322 -0.396667 -0.398602 -0.388178 0.364701 0.248321 0.262243 0.283030 0.250206 0.294767 0.244342 0.247818 0.253324 0.374344 0.240140 0.205075 0.218282 0.227097 0.201226 0.207156 0.199483 0.201594 0.206007 0.204558 0.191139
chargesum: 0.00000
title: Mulliken charges with hydrogens summed into heavy atoms:
elementType: P O O O N N N C C C C C C C C C C C
charge: 1.272979 -0.575944 -0.303360 -0.290826 -0.467096 -0.420704 -0.390233 0.144117 0.114152 0.146134 0.115882 0.284715 -0.020009 -0.000999 0.009972 0.008999 0.007519 0.364701
polarizability: 2.10447256e+02 4.65425275e+00 1.66762371e+02 2.96616401e+00 1.11455065e+00 1.36930385e+02
1716.lowfreq: -13.6109 -8.4174 -3.9722 -0.0017 -0.0016 -0.0010 21.2144 24.9490 41.1003
frequency: 19.6797 23.4404 41.0448 47.8303 52.3522 75.8302 96.4471 98.2784 126.1690 152.2369 170.6660 189.8808 207.3008 212.0868 221.3834 267.4886 296.0940 323.9729 330.2584 350.2157 373.5724 402.9544 430.0198 444.8366 468.4808 505.9541 562.0716 587.7806 623.8273 681.2126 710.9707 757.5910 784.6869 787.1251 800.4724 803.5776 810.3400 816.4621 839.5255 881.4112 886.4349 894.9578 897.0457 901.3259 922.9809 994.1648 998.6251 1000.0413 1011.9932 1033.5996 1045.2823 1053.1577 1075.1318 1080.0241 1083.2908 1106.4479 1109.4057 1116.7840 1121.7266 1129.7801 1151.3836 1152.7724 1155.7194 1160.1498 1198.5556 1241.3177 1242.2626 1253.0211 1253.4962 1259.4895 1300.9045 1308.8423 1331.6070 1332.7543 1338.9027 1350.4657 1356.8922 1388.6014 1454.7877 1458.1968 1462.3676 1464.9140 1466.0734 1468.4386 1471.0142 1472.1519 1481.1021 1626.9851 2972.8262 2974.4155 2976.1913 2986.8673 2990.9870 3018.1519 3036.7462 3038.7705 3047.2051 3057.3110 3066.2132 3081.9586 3085.0045 3089.5751 3092.3270 3189.2295 3189.8902 3206.8844 3208.7279 3540.8573
redmass: 3.2481 4.1989 4.5700 3.5149 2.9772 6.6022 6.2359 3.9848 3.2723 4.8199 4.4366 4.5257 2.5164 2.9693 3.3474 4.8068 4.9645 1.9248 5.0926 5.2505 4.8424 5.1308 3.0258 2.5273 2.9137 3.3322 3.4169 5.4688 1.3512 8.1902 11.1459 3.8235 6.7500 1.4446 2.0492 1.2126 1.1696 7.5586 2.2244 1.9791 4.0073 2.8756 1.9296 4.1586 1.7128 2.7345 1.1111 1.0704 5.1732 8.0286 2.0013 1.1022 1.2657 1.2676 1.2974 1.3359 2.6922 1.3368 1.3015 1.2853 1.4149 2.2808 1.4739 1.9128 1.4928 3.2767 1.3176 3.4368 1.2846 1.3145 1.1954 1.3172 1.3785 1.4291 1.4615 1.5400 1.4856 2.2544 1.0797 1.0749 1.0853 1.0896 1.0909 1.1729 1.1661 1.0826 1.0978 9.0975 1.0650 1.0622 1.0627 1.0615 1.0635 1.0839 1.0955 1.0982 1.1011 1.1024 1.1025 1.0497 1.0493 1.0598 1.0589 1.1187 1.1187 1.1179 1.1188 1.0765
irintensity: 0.1358 0.5486 1.9832 4.6374 1.2040 0.7917 5.5918 1.3451 0.1718 6.1374 0.4717 15.6636 3.7044 3.6248 2.0101 21.0870 4.4933 3.3158 4.4513 8.2911 4.7828 25.5500 0.1599 0.1697 11.6242 23.3445 72.1925 54.8589 89.5193 45.2131 39.4880 117.1104 9.7269 0.6813 10.1806 62.0775 12.7790 7.4302 8.1211 9.9733 199.3407 42.3202 62.3894 70.5530 0.2133 3.8032 9.8978 0.4956 194.1481 65.6333 8.2461 1.6060 4.7095 3.9385 4.7107 8.7251 1.0176 4.2181 11.7152 13.2609 3.9630 0.6511 54.2616 274.4143 0.8316 64.9522 0.1851 48.5392 5.6620 11.9333 20.8244 0.7630 9.8913 84.6128 2.3022 8.3357 162.1547 535.2193 7.4539 13.7182 1.2824 10.4324 9.9231 2.8411 3.1236 19.8169 3.4406 209.7369 33.7112 34.5495 32.2738 11.3364 19.5392 18.9308 60.5282 61.7457 39.9453 13.9669 75.3662 14.0816 18.1376 24.9663 28.5168 5.4948 2.8210 11.1256 9.6617 49.0886
temp: 298.150 k
press: 1.00000 atm
elementType: 15 8 8 8 7 7 7 6 6 6 6 6 6 6 6 6 6 6 1 1 1 1 1 1 1 1 1 1 1 1 1 1 1 1 1 1 1 1
symmnumber: 1
zpe: 815201.4 jmol-1
zpe.correction: 0.310494 hartree
zpe.thermalcorrener: 0.330132 hartree
zpe.thermalcorrenthalpy: 0.331076 hartree
zpe.thermalcorrgfe: 0.259740 hartree
zpe.sumelectzpe: -1160.818513 hartree
zpe.sumelectthermal: -1160.798876 hartree
zpe.sumelectthermalent: -1160.797931 hartree
zpe.sumelectthermalfe: -1160.869267 hartree
dipole: 1.8490 -0.1870 -3.7326
dipole: 4.1697
quadrupole: -99.2223 -106.1950 -123.3065
quadrupole: 0.9776 8.4168 -0.0666
quadrupole: 10.3523 3.3796 -13.7319 0.9776 8.4168 -0.0666
hfenergy: -1161.1290072 hartree
pointgroup: C01 [X(C11H20N3O3P1)]
dipole: -0.7160158 -0.2309011 -1.4578032 debye
polarizability: 210.65479|3.1445003|164.7826316|-3.2499844|-7.1765499|138.7025904 unknown
InChI: InChI=1S/C11H20N3O3P/c15-11(17-10-4-2-1-3-5-10)12-18(16,13-6-7-13)14-8-9-14/h10,12H,1-9H2
charge 0 multiplicity 1
38 atoms
P  2.588967 0.053519 0.32966
O  2.869113 0.691448 1.767402
O  -1.27536 0.656408 -0.41133
O  -0.302325 -0.781745 1.187213
N  3.494675 0.734067 -1.059112
N  2.969996 -1.668055 0.221886
N  0.986592 0.393919 -0.378871
C  5.008388 0.682946 -0.987035
C  4.296236 2.003232 -0.780935
C  2.333552 -2.683871 1.144293
C  2.054824 -2.720977 -0.351036
C  -2.650325 0.317134 0.09778
C  -3.529613 1.534657 -0.213957
C  -3.158982 -0.964476 -0.584711
C  -4.997052 1.254922 0.199542
C  -4.625812 -1.24412 -0.167973
C  -5.53684 -0.030922 -0.471845
C  -0.206979 0.022444 0.221356
H  5.48675 0.459935 -1.944896
H  5.465236 0.2091 -0.110527
H  4.257922 2.401871 0.240192
H  4.256871 2.735963 -1.591583
H  1.518023 -2.340197 1.790021
H  3.04472 -3.387036 1.586908
H  2.560676 -3.450743 -0.990229
H  1.055387 -2.415457 -0.680696
H  0.953629 0.978544 -1.218892
H  -2.565749 0.153632 1.189402
H  -3.48068 1.740361 -1.301263
H  -3.135254 2.424709 0.309346
H  -2.510293 -1.816687 -0.31211
H  -3.101386 -0.82898 -1.682936
H  -5.627691 2.123838 -0.067149
H  -5.056087 1.144729 1.301846
H  -4.662585 -1.467288 0.917966
H  -4.994261 -2.146505 -0.691144
H  -6.569112 -0.234408 -0.128562
H  -5.586373 0.123088 -1.569424
