program: Orca
programVersion: 5.0.3
elementType: C H C H C C C H H C H H C C H H H H H H H
charge: 1
multiplicity: 1
keywords: DSD-PBEP86 def2-TZVP RIJCOSX verytightscf def2-TZVP/C def2/J soscf noTRAH
formula: C8H13
InChI: InChI=1/C8H13/c1-2-4-6-8-7-5-3-1/h1-2,7H,3-6,8H2
21 atoms
C  -1.997884 0.744732 0.075443
H  -2.184329 0.85826 1.146703
C  -1.743302 -0.944291 -0.148765
H  -2.618399 -1.331529 0.378404
C  -0.425246 -1.373119 0.401464
C  0.692812 -1.283492 -0.368014
C  2.005957 -0.687641 0.066394
H  2.218095 -0.878284 1.12419
H  2.858325 -1.027563 -0.52679
C  1.796591 0.884304 -0.145112
H  1.852086 1.129984 -1.210912
H  2.605875 1.42136 0.354894
C  0.422335 1.254802 0.460988
C  -0.759178 1.31608 -0.378543
H  0.528896 -1.21341 -1.447933
H  -1.842899 -1.12286 -1.220422
H  0.131621 0.350442 1.026128
H  -0.637352 1.445318 -1.457736
H  -2.874207 0.98474 -0.526579
H  0.402675 1.956511 1.312614
H  -0.34524 -1.509506 1.481246
totalener: -311.11049591 hartree
nucrepener: 380.41692819 hartree
electener: -691.52742409 hartree
oneelecener: -1161.16000971 hartree
twoeener: 469.63258562 hartree
kineticenergy: 309.98393068 hartree
exchangeener: -12.753378600189 hartree
correlationener: -0.944808388714 hartree
xcener: -13.698186988903 hartree
chargesum: 1.0000000
charge: -0.250006 0.192514 -0.233684 0.193529 -0.172749 -0.127528 -0.207658 0.158097 0.167361 -0.300335 0.159404 0.171994 -0.103160 0.088995 0.144020 0.183715 0.118851 0.206149 0.195795 0.231658 0.183038
charge: -0.171186 0.164131 -0.136742 0.159297 -0.201052 -0.114413 -0.210416 0.148108 0.147509 -0.200322 0.141969 0.150489 -0.216517 0.149549 0.151004 0.152585 0.212766 0.172803 0.159386 0.190335 0.150718
qa: -0.2500 0.1925 -0.2337 0.1935 -0.1727 -0.1275 -0.2077 0.1581 0.1674 -0.3003 0.1594 0.1720 -0.1032 0.0890 0.1440 0.1837 0.1189 0.2061 0.1958 0.2317 0.1830
va: 3.8464 0.9630 3.8879 0.9568 3.7794 3.8953 3.8499 0.9715 0.9736 3.9231 0.9667 0.9708 3.6621 3.6016 0.9671 0.9609 1.0491 0.9469 0.9638 0.9410 0.9595
total: -311.798324229 hartree
energy: -311.798324228546
dipole: 0.08917 -0.91776 -0.82859 0.99688 0.10197 1.09885 0.40664 -0.53357 -0.12693
magnitude: 1.38208 au
magnitude: 3.51296 debye
