program: Orca
programVersion: 5.0.3
elementType: C H C H C C C H H C H H C C H H H H H H H
charge: 1
multiplicity: 1
keywords: b3lyp cc-pVTZ EnGrad D3BJ RIJCOSX verytightscf cc-pVTZ/C def2/J soscf
formula: C8H13
InChI: InChI=1/C8H12.H/c1-2-4-6-8-7-5-3-1;/h1-2,7-8H,3-6H2;
21 atoms
C  -1.974591 0.653054 0.124605
H  -2.125945 0.844365 1.191599
C  -1.851069 -0.94855 -0.118673
H  -2.653133 -1.441302 0.433794
C  -0.470074 -1.347941 0.372965
C  0.672691 -1.257558 -0.385085
C  1.974977 -0.654646 0.112828
H  2.129471 -0.855329 1.177619
H  2.844701 -1.012349 -0.441046
C  1.850558 0.950097 -0.115734
H  1.972913 1.172993 -1.18021
H  2.654525 1.437142 0.438956
C  0.471387 1.345627 0.38321
C  -0.67353 1.261386 -0.371484
H  0.550108 -1.263894 -1.471293
H  -1.976383 -1.162279 -1.18474
H  -0.00064 0.000508 -0.004139
H  -0.554479 1.279187 -1.458236
H  -2.845826 1.016739 -0.423184
H  0.350187 1.326719 1.471492
H  -0.346562 -1.345418 1.45838
totalener: -312.18471453 hartree
nucrepener: 382.93506206 hartree
electener: -695.11977659 hartree
oneelecener: -1166.36936635 hartree
twoeener: 471.24958976 hartree
kineticenergy: 309.94960210 hartree
exchangeener: -36.296993343853 hartree
correlationener: -2.309405828933 hartree
xcener: -38.606399172785 hartree
chargesum: 1.0000000
charge: -0.197782 0.143491 -0.197798 0.158813 -0.037000 -0.037162 -0.197982 0.143543 0.158611 -0.197941 0.143601 0.158924 -0.035661 -0.037194 0.156960 0.143624 0.102962 0.156790 0.158528 0.155693 0.156979
charge: 0.114039 -0.004696 0.114068 0.000828 0.141496 0.141044 0.114247 -0.004728 0.000713 0.114077 -0.004791 0.000790 0.140539 0.140702 0.001233 -0.004709 -0.010077 0.001357 0.000773 0.002271 0.000823
qa: -0.1978 0.1435 -0.1978 0.1588 -0.0370 -0.0372 -0.1980 0.1435 0.1586 -0.1979 0.1436 0.1589 -0.0357 -0.0372 0.1570 0.1436 0.1030 0.1568 0.1585 0.1557 0.1570
va: 3.8528 0.9887 3.8520 0.9812 3.7662 3.7666 3.8529 0.9887 0.9813 3.8521 0.9889 0.9811 3.7662 3.7669 0.9941 0.9888 1.1110 0.9941 0.9813 0.9944 0.9942
dispcorr: -0.037107988 hartree
energy: -312.221822517730
dipole: -0.00135 0.00179 0.00044 -0.00438 0.00339 -0.00098 0.00389 -0.00454 -0.00065
magnitude: 0.00126 au
magnitude: 0.00320 debye
