program: Orca
programVersion: 5.0.3
elementType: C H C H C C C H H C H H C C H H H H H H H
charge: 1
multiplicity: 1
keywords: DSD-PBEP86/2013 cc-pVTZ EnGrad RIJCOSX verytightscf cc-pVTZ/C def2/J soscf
formula: C8H13
InChI: InChI=1/C8H13/c1-2-4-6-8-7-5-3-1/h1-2,7H,3-6,8H2
21 atoms
C  -1.992965 0.517875 0.075766
H  -2.193824 0.779757 1.117906
C  -1.999809 -1.021937 -0.124688
H  -2.681499 -1.581882 0.516136
C  -0.543508 -1.086389 0.288776
C  0.573752 -1.059823 -0.527722
C  1.900858 -0.628323 0.020647
H  2.018429 -0.994657 1.046199
H  2.721031 -1.02656 -0.582071
C  1.936222 0.938664 0.018222
H  2.139529 1.294391 -0.998033
H  2.751163 1.292336 0.655027
C  0.569028 1.469915 0.48905
C  -0.49278 0.708694 -0.260575
H  0.472741 -1.27139 -1.591234
H  -2.155072 -1.306424 -1.168985
H  0.436809 1.3737 1.572122
H  -0.370839 0.80241 -1.343087
H  -2.650465 1.093627 -0.580758
H  0.470831 2.535762 0.241206
H  -0.367026 -1.031806 1.363633
totalener: -311.18272390 hartree
nucrepener: 387.51972149 hartree
electener: -698.70244539 hartree
oneelecener: -1175.20883869 hartree
twoeener: 476.50639330 hartree
kineticenergy: 309.75560862 hartree
exchangeener: -12.764440198650 hartree
correlationener: -0.949913135001 hartree
xcener: -13.714353333651 hartree
chargesum: 1.0000000
charge: -0.215071 0.171124 -0.245808 0.186490 -0.037685 -0.043746 -0.255691 0.167469 0.183555 -0.252214 0.164626 0.181544 -0.240952 -0.097505 0.226376 0.171654 0.160366 0.194918 0.183985 0.192615 0.203948
charge: 0.109345 0.000234 0.109038 -0.000367 0.126136 0.180501 0.085864 0.002852 0.006514 0.095908 -0.006104 -0.000040 0.066319 0.185226 0.006399 -0.000091 -0.003599 0.005197 -0.001945 0.015849 0.016762
qa: -0.2151 0.1711 -0.2458 0.1865 -0.0377 -0.0437 -0.2557 0.1675 0.1836 -0.2522 0.1646 0.1815 -0.2410 -0.0975 0.2264 0.1717 0.1604 0.1949 0.1840 0.1926 0.2039
va: 3.8668 0.9850 3.8894 0.9768 3.7803 3.7663 3.9225 0.9816 0.9763 3.8955 0.9801 0.9735 3.8929 3.7782 0.9590 0.9845 0.9845 0.9819 0.9744 0.9677 0.9765
energy: -311.886796869630
dipole: 0.55460 -0.71340 -0.15880 1.83397 -1.94483 -0.11086 0.23233 -0.40079 -0.16846
magnitude: 0.25669 au
magnitude: 0.65244 debye
