program: Orca
programVersion: 5.0.3
elementType: C H C H C C C H H C H H C C H H H H H H H
charge: 1
multiplicity: 1
keywords: DSD-PBEP86 cc-pVTZ EnGrad RIJCOSX verytightscf cc-pVTZ/C def2/J soscf
formula: C8H13
InChI: InChI=1/C8H13/c1-2-4-6-8-7-5-3-1/h1-2,7H,3-6,8H2
21 atoms
C  -2.003025 0.738699 0.069816
H  -2.169705 0.806221 1.147825
C  -1.73502 -0.975447 -0.167607
H  -2.621236 -1.347979 0.351131
C  -0.41047 -1.38299 0.385562
C  0.679651 -1.269789 -0.391034
C  1.993578 -0.702335 0.063569
H  2.195041 -0.915846 1.118673
H  2.851588 -1.03786 -0.525997
C  1.789247 0.836024 -0.130288
H  1.822142 1.099763 -1.19328
H  2.595381 1.386154 0.362362
C  0.428567 1.303197 0.497555
C  -0.763707 1.286632 -0.352572
H  0.515814 -1.188527 -1.470242
H  -1.828479 -1.13776 -1.242397
H  0.230332 0.794153 1.443702
H  -0.658574 1.63751 -1.383187
H  -2.879063 0.997215 -0.524189
H  0.525597 2.383036 0.750468
H  -0.322497 -1.465842 1.468071
totalener: -311.13557929 hartree
nucrepener: 379.08239171 hartree
electener: -690.21797099 hartree
oneelecener: -1158.58328982 hartree
twoeener: 468.36531882 hartree
kineticenergy: 309.72913198 hartree
exchangeener: -12.751639916976 hartree
correlationener: -0.942472473711 hartree
xcener: -13.694112390687 hartree
chargesum: 1.0000000
charge: -0.268430 0.202604 -0.239998 0.199782 -0.164130 -0.130565 -0.239296 0.160408 0.176660 -0.256352 0.159968 0.179443 -0.245582 0.093475 0.166154 0.190734 0.165977 0.240737 0.202967 0.214625 0.190820
charge: 0.130486 0.014340 0.172089 0.005525 0.023365 0.058210 0.070669 -0.003390 -0.001122 0.105642 -0.010386 -0.000655 0.079381 0.312891 -0.016905 -0.001164 0.006317 0.021423 0.006352 0.048744 -0.021813
qa: -0.2684 0.2026 -0.2400 0.1998 -0.1641 -0.1306 -0.2393 0.1604 0.1767 -0.2564 0.1600 0.1794 -0.2456 0.0935 0.1662 0.1907 0.1660 0.2407 0.2030 0.2146 0.1908
va: 3.8827 0.9704 3.9051 0.9655 3.8157 3.8480 3.9043 0.9860 0.9768 3.8887 0.9831 0.9732 3.9171 3.5504 0.9829 0.9723 0.9935 0.9526 0.9734 0.9635 0.9787
energy: -311.836921823779
dipole: 0.24005 -1.11126 -0.87122 1.88234 -0.66132 1.22102 0.28364 -0.42456 -0.14092
magnitude: 1.50657 au
magnitude: 3.82940 debye
