program: Orca
programVersion: 5.0.3
elementType: C H C H C C C H H C H H C C H H H H H H H
charge: 1
multiplicity: 1
keywords: DSD-PBEP86/2013 cc-pVTZ EnGrad D3BJ RIJCOSX verytightscf cc-pVTZ/C def2/J soscf
formula: C8H13
InChI: InChI=1/C8H13/c1-2-4-6-8-7-5-3-1/h1-2,7H,3-6,8H2
21 atoms
C  -1.998994 0.648378 0.076698
H  -2.176419 0.788326 1.149065
C  -1.781447 -0.953424 -0.171834
H  -2.636245 -1.430544 0.316524
C  -0.417797 -1.348188 0.370231
C  0.666143 -1.260135 -0.415347
C  1.969653 -0.706699 0.069632
H  2.156807 -0.938495 1.123204
H  2.83484 -1.034847 -0.516211
C  1.806884 0.83565 -0.116247
H  1.842001 1.094685 -1.180364
H  2.623495 1.372752 0.373924
C  0.452701 1.370797 0.502997
C  -0.729946 1.238968 -0.331109
H  0.518612 -1.215833 -1.498083
H  -1.845447 -1.142218 -1.247287
H  0.286968 0.98212 1.509764
H  -0.640085 1.596152 -1.362083
H  -2.850787 0.988791 -0.517285
H  0.595735 2.471539 0.577232
H  -0.313246 -1.414257 1.453467
totalener: -311.13613181 hartree
nucrepener: 379.45671586 hartree
electener: -690.59284766 hartree
oneelecener: -1159.33596945 hartree
twoeener: 468.74312179 hartree
kineticenergy: 309.72126494 hartree
exchangeener: -14.118781806579 hartree
correlationener: -0.942627482376 hartree
xcener: -15.061409288956 hartree
chargesum: 1.0000000
charge: -0.236822 0.189090 -0.239237 0.185797 -0.159475 -0.154162 -0.231805 0.161049 0.176339 -0.245823 0.157693 0.179977 -0.234334 0.095329 0.174672 0.174528 0.171736 0.241383 0.193060 0.213182 0.187820
charge: 0.109284 0.014049 0.121543 0.001663 0.051762 0.045213 0.070188 -0.003069 0.002146 0.114352 -0.009356 -0.000825 0.081252 0.355082 -0.018672 -0.001559 0.006185 0.023318 0.009176 0.049649 -0.021383
qa: -0.2368 0.1891 -0.2392 0.1858 -0.1595 -0.1542 -0.2318 0.1610 0.1763 -0.2458 0.1577 0.1800 -0.2343 0.0953 0.1747 0.1745 0.1717 0.2414 0.1931 0.2132 0.1878
va: 3.8621 0.9758 3.9124 0.9716 3.8252 3.8457 3.9003 0.9864 0.9773 3.8805 0.9833 0.9728 3.9149 3.5044 0.9802 0.9798 0.9883 0.9509 0.9760 0.9655 0.9802
dispcorr: -0.014133493 hartree
energy: -311.820664204712
dipole: 0.37113 -1.02710 -0.65597 1.98305 -0.63819 1.34485 0.17024 -0.30950 -0.13926
magnitude: 1.50277 au
magnitude: 3.81974 debye
