program: Orca
programVersion: 5.0.3
elementType: C H C H C C C H H C H H C C H H H H H H H
charge: 1
multiplicity: 1
keywords: DSD-PBEP86/2013 cc-pVTZ EnGrad RIJCOSX verytightscf cc-pVTZ/C def2/J soscf
formula: C8H13
InChI: InChI=1/C8H13/c1-2-4-6-8-7-5-3-1/h1-2,7H,3-6,8H2
21 atoms
C  -1.998823 0.759882 0.070097
H  -2.162407 0.831319 1.148069
C  -1.730077 -0.966628 -0.158198
H  -2.618389 -1.317776 0.371101
C  -0.416526 -1.386741 0.393002
C  0.68618 -1.27636 -0.377526
C  2.001413 -0.69183 0.062897
H  2.209523 -0.889387 1.120035
H  2.855864 -1.034151 -0.526869
C  1.78916 0.858004 -0.140365
H  1.830832 1.118468 -1.203623
H  2.59301 1.406508 0.357579
C  0.421924 1.261533 0.488959
C  -0.767777 1.301036 -0.373424
H  0.521648 -1.20174 -1.457183
H  -1.834153 -1.126926 -1.231714
H  0.188852 0.58111 1.313954
H  -0.659063 1.588678 -1.422817
H  -2.882524 0.991684 -0.522719
H  0.468109 2.247142 0.997338
H  -0.335232 -1.487251 1.474839
totalener: -311.12682704 hartree
nucrepener: 379.49341122 hartree
electener: -690.62023826 hartree
oneelecener: -1159.38433196 hartree
twoeener: 468.76409369 hartree
kineticenergy: 309.72647373 hartree
exchangeener: -12.751034351492 hartree
correlationener: -0.942904781989 hartree
xcener: -13.693939133481 hartree
chargesum: 1.0000000
charge: -0.269183 0.202417 -0.243009 0.202419 -0.153192 -0.126687 -0.240083 0.158464 0.175947 -0.262500 0.161249 0.179238 -0.250279 0.101578 0.166207 0.193410 0.157415 0.235053 0.205019 0.219589 0.186927
charge: 0.132078 0.014411 0.176947 0.007967 0.019105 0.068589 0.074466 -0.004351 -0.003023 0.104258 -0.012077 -0.001197 0.075079 0.310231 -0.016750 -0.000408 0.007190 0.018360 0.006658 0.043480 -0.021012
qa: -0.2692 0.2024 -0.2430 0.2024 -0.1532 -0.1267 -0.2401 0.1585 0.1759 -0.2625 0.1612 0.1792 -0.2503 0.1016 0.1662 0.1934 0.1574 0.2351 0.2050 0.2196 0.1869
va: 3.8880 0.9699 3.9095 0.9643 3.8237 3.8457 3.9083 0.9862 0.9766 3.8900 0.9835 0.9746 3.8976 3.5553 0.9826 0.9709 1.0032 0.9568 0.9714 0.9615 0.9808
energy: -311.830010787850
dipole: 0.16485 -1.08647 -0.92162 1.59914 -0.49055 1.10858 0.39145 -0.51622 -0.12477
magnitude: 1.44704 au
magnitude: 3.67807 debye
