program: Gaussian 09
title: 000051111
version: EM64L-G09RevD.01
frameworkgroup: C1[X(C5H11N3O3)]
method: RPBEPBE
basis: SDD
operation: Freq
keyword: #p
keyword: freq=noraman
keyword: PBEPBE/SDD
title: #p freq=noraman PBEPBE/SDD
converged: YES YES NO NO
title: Mulliken charges:
elementType: O O O N N N C C C C C H H H H H H H H H H H
charge: -0.290844 -0.301791 -0.283454 -0.028709 -0.325098 0.051369 -0.434977 -0.222480 -0.593483 0.321316 -0.671188 0.257244 0.282270 0.347949 0.229534 0.227912 0.234166 0.272795 0.252382 0.212473 0.231712 0.230900
chargesum: 0.00000
title: Mulliken charges with hydrogens summed into heavy atoms:
elementType: O O O N N N C C C C C
charge: -0.290844 -0.301791 -0.283454 -0.028709 0.022851 0.051369 0.104536 0.234966 0.165860 0.321316 0.003898
polarizability: 1.05555941e+02 -3.09633513e+00 9.48915747e+01 6.11726917e-01 -6.41346789e-01 6.48554154e+01
1716.lowfreq: -10.2401 -6.6634 -0.0007 -0.0006 0.0007 5.0640 33.6003 42.1004 55.4539
frequency: 33.3970 42.0769 55.4079 76.9238 118.0897 136.0778 152.3886 192.6239 234.9762 248.7720 304.8528 340.3574 349.5091 377.0744 426.3256 558.0206 612.5530 628.0555 675.0411 707.8419 800.9292 811.8163 838.3065 911.7894 963.5410 1017.5272 1028.1920 1110.7500 1118.8607 1124.4924 1139.3988 1187.9095 1206.2336 1238.8961 1250.0637 1321.3698 1342.6694 1358.3178 1393.9977 1400.8912 1424.9054 1428.2128 1462.1277 1462.8743 1473.7455 1480.0788 1487.7622 1493.1467 1644.4303 2986.5214 2996.9215 3009.8819 3050.3728 3068.7967 3075.7398 3094.0759 3108.8420 3120.4231 3123.6923 3571.5819
redmass: 2.8906 4.4169 3.8729 4.7773 3.2472 3.8785 1.1715 3.0275 5.4570 1.2355 4.9173 4.9991 3.8767 2.0911 4.6767 2.5916 1.6146 4.3316 4.0365 11.4531 1.0993 3.3711 5.0268 3.8547 3.0338 2.3470 2.5101 2.6166 1.3140 3.7874 1.4589 2.0326 3.4625 2.4436 1.1344 8.3730 1.4859 1.3279 1.1838 1.2586 1.1143 1.1803 1.0490 1.0403 1.3054 1.2314 1.0620 1.1908 8.6467 1.0344 1.0358 1.0580 1.0590 1.1070 1.1010 1.0985 1.1027 1.1012 1.1055 1.0779
irintensity: 0.7116 4.2151 5.8222 8.5760 3.0810 9.6214 0.1115 2.7525 3.9286 1.4559 11.0860 5.8832 3.4125 13.5847 2.7590 39.2391 93.7391 13.0090 15.1404 21.8126 5.0110 10.6951 22.4796 83.5460 176.3740 8.6968 88.6896 25.1044 0.7182 37.1452 5.3558 222.4666 108.4771 162.6098 0.5028 79.7819 35.2963 1.0111 4.9046 31.5125 28.4168 33.6606 10.0516 12.0749 206.3959 91.9496 16.6756 71.4526 234.5887 31.2779 19.5330 22.6882 16.9447 9.6765 15.8428 29.4838 45.0904 4.8978 0.6792 49.2653
temp: 298.150 k
press: 1.00000 atm
elementType: 8 8 8 7 7 7 6 6 6 6 6 1 1 1 1 1 1 1 1 1 1 1
symmnumber: 1
zpe: 456976.2 jmol-1
zpe.correction: 0.174053 hartree
zpe.thermalcorrener: 0.186895 hartree
zpe.thermalcorrenthalpy: 0.187839 hartree
zpe.thermalcorrgfe: 0.133156 hartree
zpe.sumelectzpe: -586.122053 hartree
zpe.sumelectthermal: -586.109211 hartree
zpe.sumelectthermalent: -586.108267 hartree
zpe.sumelectthermalfe: -586.162951 hartree
dipole: -1.8893 1.9464 0.7745
dipole: 2.8210
quadrupole: -60.4165 -72.0764 -63.1086
quadrupole: 11.6650 5.5924 -3.4726
quadrupole: 4.7840 -6.8759 2.0919 11.6650 5.5924 -3.4726
hfenergy: -586.2961063 hartree
pointgroup: C01 [X(C5H11N3O3)]
dipole: -0.7514015 -0.40518 0.709218 debye
dipolederiv: -1.8122912 0.2368568 -0.1768883 0.3595804 -0.3529662 0.0403074 -0.4334904 0.0715695 -0.5299281 -0.7543789 0.0349677 0.0031991 0.0480249 -0.3631146 0.0202736 -0.0052206 0.0450786 -1.004557 -0.2611244 -0.0293752 -0.1356199 0.0659351 -0.2280309 -0.3485391 0.3497492 0.2064678 -1.0794148 -0.5042043 -0.0283347 0.2922767 -0.2065283 -0.3531186 0.4319056 -0.0037509 0.0936 -0.6808794 -1.428507 -0.0415534 0.2360987 0.2519484 -0.5857255 -0.1138425 0.3181157 -0.1200573 -0.4700755 0.0696752 0.1328927 -0.287354 0.0220915 0.0257375 -0.2162879 -0.5439194 -0.3843567 1.2649273 1.0438683 0.0918308 0.0368039 0.0981658 0.4921876 -0.0285702 0.3842992 0.0362176 0.1054039 1.01036 -0.1101723 -0.0050629 -0.1471728 0.3873425 0.0034249 -0.2172641 0.033777 0.247382 0.1378149 -0.0819173 0.1135543 -0.1079722 0.1054578 0.0855238 0.134041 0.0525587 0.3336766 2.2912698 -0.2812578 -0.10018 -0.4513339 0.363194 0.0056826 0.0391386 -0.0727076 1.4320558 -0.1039044 0.0330935 -0.0804442 0.0393718 0.0534192 0.0208994 -0.0609254 0.0204573 0.0015397 0.0695661 -0.0423498 0.0138359 -0.0399726 0.0864656 0.0381146 -0.0771243 0.0892138 0.0108237 -0.0407894 0.0373945 0.0305516 -0.0146255 0.04795 -0.0174406 0.0155215 -0.1253325 0.0542723 0.1822481 0.0573635 0.0564072 0.0471088 0.3458664 0.0733242 -0.0419545 0.0328073 0.2060948 -0.0426974 0.0141994 0.0040917 -0.0215984 -0.0633821 0.1069609 0.0897673 0.0756517 -0.0023128 -0.0492222 -0.0335189 -0.0469671 0.0106709 -0.059469 -0.0991095 0.047109 -0.1011283 -0.0074275 0.0464008 0.0753821 -0.0937888 0.1187415 -0.0003851 0.0793721 -0.0611108 0.0318353 -0.0559414 -0.0073883 0.0513031 0.071584 0.0439583 0.1275796 -0.01591 0.0347493 -0.0120031 0.0185206 0.0731932 -0.0939721 -0.0332162 -0.0948361 -0.0261019 -0.0401543 0.0140107 0.035734 0.105021 -0.1236923 0.0522821 0.0713132 0.0571489 0.1041564 -0.0169769 0.0962678 -0.0236899 0.0342462 0.0945633 -0.0670782 0.042312 -0.0394569 -0.0462145 0.1092584 -0.0145949 0.1075868 0.0096512 0.10924 -0.0080365 -0.0125068 -0.0392496 -0.0608481 -0.1182167 -0.063414 -0.0932798 0.0069213 unknown
polarizability: 105.7010918|1.9229137|65.0276911|-2.5967529|-1.8662564|94.5741483 unknown
InChI: InChI=1S/C5H11N3O3/c1-3-11-5(9)6-4-8(2)7-10/h6H,3-4H2,1-2H3
charge 0 multiplicity 1
22 atoms
O  -2.202195 0.051814 -0.602113
O  -1.087163 -0.240736 1.456749
O  2.470817 0.747124 -1.878519
N  2.082749 0.481653 0.310603
N  0.008833 -0.484615 -0.604863
N  2.672443 1.224977 -0.69281
C  1.312243 -0.749332 -0.013838
C  -3.462845 0.348938 0.140881
C  2.197179 0.995806 1.684073
C  -1.087817 -0.224088 0.195625
C  -4.535105 0.6117 -0.911281
H  1.175631 -1.301679 0.928134
H  1.909505 -1.335549 -0.731188
H  -0.055733 -0.324731 -1.611185
H  -3.70325 -0.517823 0.782535
H  -3.286562 1.223886 0.792538
H  2.776991 0.300749 2.318836
H  1.193226 1.126027 2.123554
H  2.719477 1.964301 1.635665
H  -5.49596 0.839702 -0.415021
H  -4.260742 1.469547 -1.548558
H  -4.678222 -0.271372 -1.557016
