program: Orca
programVersion: 5.0.3
elementType: C H C H C C C H H C H H C C H H H H H H H
charge: 1
multiplicity: 1
keywords: DSD-PBEP86 def2-TZVP D3BJ RIJCOSX verytightscf def2-TZVP/C def2/J soscf noTRAH
formula: C8H13
InChI: InChI=1/C8H13/c1-2-4-6-8-7-5-3-1/h1-2,7H,3-6,8H2
21 atoms
C  -1.99778 0.528988 0.119815
H  -2.175937 0.722721 1.181077
C  -1.958015 -0.998063 -0.169806
H  -2.676103 -1.59163 0.398134
C  -0.519346 -1.136076 0.281257
C  0.609477 -1.120939 -0.504701
C  1.906967 -0.650818 0.064379
H  2.006436 -0.952499 1.112471
H  2.761274 -1.04496 -0.492599
C  1.896647 0.914378 -0.034582
H  2.024853 1.208304 -1.082965
H  2.743524 1.32684 0.520124
C  0.558315 1.481307 0.489557
C  -0.546097 0.81815 -0.262587
H  0.530192 -1.299242 -1.576661
H  -2.074265 -1.208557 -1.237012
H  0.442459 1.361496 1.57165
H  -0.421125 0.881866 -1.346495
H  -2.713954 1.099968 -0.479528
H  0.521039 2.560947 0.272778
H  -0.369002 -1.08506 1.360873
totalener: -311.15410310 hartree
nucrepener: 385.59551521 hartree
electener: -696.74961831 hartree
oneelecener: -1171.45698136 hartree
twoeener: 474.70736306 hartree
kineticenergy: 310.03124614 hartree
exchangeener: -13.675277917104 hartree
correlationener: -0.926699489429 hartree
xcener: -14.601977406533 hartree
chargesum: 1.0000000
charge: -0.199996 0.163812 -0.197785 0.177808 -0.080753 -0.063137 -0.223144 0.158226 0.175991 -0.235667 0.151433 0.173259 -0.205592 -0.024163 0.202153 0.159269 0.150847 0.182202 0.175319 0.181530 0.178388
charge: -0.191214 0.152980 -0.185533 0.149448 -0.061137 -0.022482 -0.205612 0.154396 0.156866 -0.206300 0.146222 0.150535 -0.223630 0.049409 0.164679 0.151997 0.151639 0.171370 0.151428 0.173985 0.170953
qa: -0.2000 0.1638 -0.1978 0.1778 -0.0808 -0.0631 -0.2231 0.1582 0.1760 -0.2357 0.1514 0.1733 -0.2056 -0.0242 0.2022 0.1593 0.1508 0.1822 0.1753 0.1815 0.1784
va: 3.8685 0.9739 3.8688 0.9721 3.8486 3.8058 3.9048 0.9688 0.9685 3.8720 0.9716 0.9668 3.9195 3.7073 0.9473 0.9741 0.9727 0.9556 0.9709 0.9654 0.9607
total: -311.828301069 hartree
dispcorr: -0.011579558 hartree
energy: -311.839880627003
dipole: 0.56170 -0.75806 -0.19636 1.85360 -1.73630 0.11729 0.18900 -0.37438 -0.18538
magnitude: 0.29441 au
magnitude: 0.74834 debye
