program: Orca
programVersion: 5.0.3
elementType: C H C H C C C H H C H H C C H H H H H H H
charge: 1
multiplicity: 1
keywords: DSD-PBEP86/2013 def2-TZVP D3BJ RIJCOSX verytightscf def2-TZVP/C def2/J soscf noTRAH
formula: C8H13
InChI: InChI=1/C8H13/c1-2-4-6-8-7-5-3-1/h1-2,7H,3-6,8H2
21 atoms
C  -2.00098 0.674135 0.074595
H  -2.177207 0.791453 1.149034
C  -1.765879 -0.959422 -0.172077
H  -2.632069 -1.406878 0.323827
C  -0.413159 -1.360143 0.374604
C  0.669761 -1.264186 -0.408394
C  1.976927 -0.707717 0.06807
H  2.168311 -0.935441 1.121862
H  2.840764 -1.036508 -0.518764
C  1.801621 0.832457 -0.119926
H  1.835863 1.092968 -1.183684
H  2.613847 1.375094 0.371283
C  0.444846 1.35477 0.500844
C  -0.742579 1.255922 -0.33448
H  0.516331 -1.202256 -1.489931
H  -1.83791 -1.141495 -1.247379
H  0.272287 0.945802 1.498316
H  -0.649083 1.615223 -1.364285
H  -2.859885 0.989736 -0.521043
H  0.579346 2.454862 0.606047
H  -0.314363 -1.429856 1.457796
totalener: -311.13804294 hartree
nucrepener: 379.24984499 hartree
electener: -690.38788793 hartree
oneelecener: -1158.95929330 hartree
twoeener: 468.57140537 hartree
kineticenergy: 310.01303521 hartree
exchangeener: -14.122035958343 hartree
correlationener: -0.942805501922 hartree
xcener: -15.064841460264 hartree
chargesum: 1.0000000
charge: -0.239072 0.188181 -0.212717 0.183301 -0.191664 -0.127684 -0.207201 0.153391 0.163696 -0.262374 0.153398 0.172025 -0.153362 0.119771 0.142612 0.177935 0.161995 0.218761 0.188619 0.205242 0.165147
charge: -0.177416 0.168773 -0.152879 0.153617 -0.158757 -0.142114 -0.219180 0.149216 0.150811 -0.194487 0.143748 0.150583 -0.203449 0.181017 0.151108 0.151678 0.161314 0.176476 0.159939 0.201194 0.148809
qa: -0.2391 0.1882 -0.2127 0.1833 -0.1917 -0.1277 -0.2072 0.1534 0.1637 -0.2624 0.1534 0.1720 -0.1534 0.1198 0.1426 0.1779 0.1620 0.2188 0.1886 0.2052 0.1651
va: 3.8642 0.9617 3.8467 0.9635 3.8675 3.8452 3.8791 0.9732 0.9722 3.8981 0.9683 0.9636 3.8263 3.4964 0.9682 0.9642 0.9820 0.9380 0.9665 0.9521 0.9655
total: -311.789351768 hartree
dispcorr: -0.014124725 hartree
energy: -311.803476493199
dipole: 0.33360 -1.08788 -0.75428 1.97790 -0.54468 1.43322 0.19015 -0.37313 -0.18298
magnitude: 1.62989 au
magnitude: 4.14285 debye
