program: Orca
programVersion: 5.0.3
elementType: C H C H C C C H H C H H C C H H H H H H H
charge: 1
multiplicity: 1
keywords: b3lyp cc-pVTZ EnGrad D3BJ RIJCOSX verytightscf cc-pVTZ/C def2/J soscf
formula: C8H13
InChI: InChI=1/C8H13/c1-2-4-6-8-7-5-3-1/h1-2,7H,3-6,8H2
21 atoms
C  -1.998124 0.527817 0.119517
H  -2.176749 0.722631 1.180477
C  -1.961788 -0.999351 -0.169071
H  -2.676489 -1.593785 0.40207
C  -0.521676 -1.130024 0.279847
C  0.60821 -1.116763 -0.506095
C  1.906505 -0.649218 0.063533
H  2.004727 -0.952739 1.111208
H  2.759547 -1.045249 -0.493972
C  1.899531 0.916307 -0.032579
H  2.031601 1.212023 -1.079939
H  2.74543 1.325679 0.525865
C  0.559817 1.481004 0.488444
C  -0.542245 0.807217 -0.260442
H  0.529286 -1.2975 -1.577657
H  -2.080051 -1.211561 -1.235668
H  0.444883 1.3653 1.571132
H  -0.419135 0.872084 -1.344526
H  -2.709847 1.102581 -0.481267
H  0.516269 2.559145 0.266911
H  -0.370805 -1.079156 1.359345
totalener: -312.25071024 hartree
nucrepener: 385.79197407 hartree
electener: -698.04268431 hartree
oneelecener: -1172.43500214 hartree
twoeener: 474.39231783 hartree
kineticenergy: 310.00692391 hartree
exchangeener: -36.324314104442 hartree
correlationener: -2.309055306222 hartree
xcener: -38.633369410663 hartree
chargesum: 1.0000000
charge: -0.160684 0.140341 -0.174528 0.153982 -0.034090 -0.033166 -0.186917 0.135523 0.154750 -0.190261 0.132767 0.152212 -0.168664 -0.038883 0.187587 0.138259 0.134160 0.172376 0.153410 0.166574 0.165253
charge: 0.101551 -0.001477 0.105464 -0.002344 0.124218 0.165439 0.086634 0.000446 0.005795 0.101942 -0.007195 -0.001156 0.070017 0.225000 -0.000391 -0.001720 -0.002599 0.001399 -0.000620 0.022336 0.007260
qa: -0.1607 0.1403 -0.1745 0.1540 -0.0341 -0.0332 -0.1869 0.1355 0.1547 -0.1903 0.1328 0.1522 -0.1687 -0.0389 0.1876 0.1383 0.1342 0.1724 0.1534 0.1666 0.1653
va: 3.8244 0.9920 3.8415 0.9834 3.7631 3.7507 3.8737 0.9906 0.9831 3.8417 0.9877 0.9807 3.8484 3.6824 0.9770 0.9929 0.9916 0.9918 0.9814 0.9758 0.9932
dispcorr: -0.035302670 hartree
energy: -312.286012907028
dipole: 0.56102 -0.70592 -0.14490 1.85290 -1.76393 0.08898 0.19100 -0.34324 -0.15224
magnitude: 0.22823 au
magnitude: 0.58013 debye
