program: Orca
programVersion: 5.0.3
elementType: C H C H C C C H H C H H C C H H H H H H H
charge: 1
multiplicity: 1
keywords: DSD-PBEP86 cc-pVTZ EnGrad RIJCOSX verytightscf cc-pVTZ/C def2/J soscf
formula: C8H13
InChI: InChI=1/C8H13/c1-3-7-5-2-6-8(4-1)9-7/h3,6-8H,1-2,4-5H2
21 atoms
C  -2.004489 0.685971 0.093471
H  -2.213194 0.874599 1.150843
C  -1.804866 -0.922285 -0.135969
H  -2.631775 -1.422092 0.371575
C  -0.442721 -1.335355 0.406378
C  0.696532 -1.276785 -0.362389
C  2.00832 -0.680227 0.083333
H  2.220132 -0.880783 1.138033
H  2.854969 -1.012905 -0.51988
C  1.814257 0.917874 -0.136052
H  1.883617 1.139986 -1.205749
H  2.631446 1.430173 0.374879
C  0.440591 1.30871 0.41045
C  -0.706802 1.298786 -0.355983
H  0.53433 -1.213088 -1.442606
H  -1.87862 -1.133335 -1.207359
H  0.007073 0.015278 0.257548
H  -0.557545 1.276627 -1.439455
H  -2.858761 1.007545 -0.504643
H  0.342315 1.391779 1.496137
H  -0.344094 -1.437834 1.489718
totalener: -311.09823125 hartree
nucrepener: 382.71511924 hartree
electener: -693.81335049 hartree
oneelecener: -1165.33380286 hartree
twoeener: 471.52045237 hartree
kineticenergy: 309.65939457 hartree
exchangeener: -12.748702429984 hartree
correlationener: -0.949204867054 hartree
xcener: -13.697907297038 hartree
chargesum: 1.0000000
charge: -0.254293 0.176209 -0.272612 0.188514 -0.075236 -0.048300 -0.252903 0.174162 0.188294 -0.269516 0.171941 0.188114 -0.076979 -0.042388 0.183470 0.173023 0.077081 0.187502 0.189188 0.197157 0.197571
charge: 0.106427 -0.002207 0.113902 0.001509 0.117485 0.153947 0.104217 -0.002525 0.002649 0.114045 -0.004139 0.001197 0.121103 0.165590 0.002651 -0.004145 -0.009832 0.003568 0.003064 0.007770 0.003724
qa: -0.2543 0.1762 -0.2726 0.1885 -0.0752 -0.0483 -0.2529 0.1742 0.1883 -0.2695 0.1719 0.1881 -0.0770 -0.0424 0.1835 0.1730 0.0771 0.1875 0.1892 0.1972 0.1976
va: 3.8901 0.9801 3.9219 0.9731 3.7904 3.8088 3.8904 0.9810 0.9721 3.9203 0.9818 0.9736 3.7917 3.7995 0.9819 0.9810 1.1414 0.9798 0.9721 0.9797 0.9786
energy: -311.814721306432
dipole: -0.00945 -0.02038 -0.02983 0.03412 0.01038 0.04450 -0.03816 0.02398 -0.01418
magnitude: 0.05542 au
magnitude: 0.14086 debye
