program: Orca
programVersion: 5.0.3
elementType: C H C H C C C H H C H H C C H H H H H H H
charge: 1
multiplicity: 1
keywords: b3lyp def2-TZVP EnGrad D3BJ RIJCOSX verytightscf def2/J soscf
formula: C8H13
InChI: InChI=1/C8H13/c1-2-4-6-8-7-5-3-1/h1-2,7H,3-6,8H2
21 atoms
C  -2.003907 0.71726 0.082113
H  -2.210494 0.876792 1.144293
C  -1.768158 -0.926107 -0.142819
H  -2.61981 -1.375388 0.372459
C  -0.430778 -1.352189 0.41037
C  0.698596 -1.284185 -0.363371
C  2.009682 -0.686795 0.07213
H  2.223485 -0.880219 1.128528
H  2.859252 -1.019801 -0.527654
C  1.803215 0.90083 -0.143083
H  1.862716 1.133158 -1.211484
H  2.618443 1.42568 0.358531
C  0.426383 1.278391 0.432095
C  -0.736718 1.318265 -0.367043
H  0.530658 -1.205896 -1.442164
H  -1.853667 -1.128735 -1.2133
H  0.057067 0.155712 0.645081
H  -0.591311 1.316483 -1.451787
H  -2.867281 0.995704 -0.523404
H  0.358437 1.632257 1.467222
H  -0.347434 -1.514489 1.487235
totalener: -312.18356815 hartree
nucrepener: 381.64974659 hartree
electener: -693.83331474 hartree
oneelecener: -1164.06535545 hartree
twoeener: 470.23204071 hartree
kineticenergy: 310.49051273 hartree
exchangeener: -36.311435225111 hartree
correlationener: -2.307210588060 hartree
xcener: -38.618645813171 hartree
chargesum: 1.0000000
charge: -0.202294 0.163096 -0.273280 0.177359 -0.056206 -0.054506 -0.197547 0.150717 0.163854 -0.295742 0.162016 0.168193 0.004516 0.009609 0.137749 0.169436 0.043185 0.168739 0.176592 0.203852 0.180663
charge: -0.184101 0.157621 -0.174034 0.160874 -0.184028 -0.075853 -0.205758 0.152272 0.153463 -0.195174 0.149839 0.155144 -0.189152 0.019889 0.158041 0.152814 0.281458 0.166584 0.159826 0.179392 0.160882
qa: -0.2023 0.1631 -0.2733 0.1774 -0.0562 -0.0545 -0.1975 0.1507 0.1639 -0.2957 0.1620 0.1682 0.0045 0.0096 0.1377 0.1694 0.0432 0.1687 0.1766 0.2039 0.1807
va: 3.8284 0.9683 3.9451 0.9634 3.6286 3.8797 3.8337 0.9699 0.9688 3.9544 0.9626 0.9700 3.5437 3.8101 0.9666 0.9626 1.0900 0.9576 0.9650 0.9541 0.9606
dispcorr: -0.037312806 hartree
energy: -312.220880956040
dipole: 0.01882 -0.35382 -0.33500 0.38585 0.05477 0.44063 0.21913 -0.24571 -0.02658
magnitude: 0.55415 au
magnitude: 1.40854 debye
