program: Gaussian 09
title: 000051144
version: EM64L-G09RevD.01
frameworkgroup: C1[X(C13H28O2)]
method: RPBEPBE
basis: SDD
operation: Freq
keyword: #pfreq=noraman
keyword: PBEPBE/SDD
title: #p freq=noraman PBEPBE/SDD
converged: YES YES NO NO
title: Mulliken charges:
elementType: O O C C C C C C C C C C C C C H H H H H H H H H H H H H H H H H H H H H H H H H H H H
charge: -0.325469 -0.450671 0.053270 -0.468166 -0.463634 -0.370232 -0.366027 -0.342279 -0.350765 -0.358479 -0.357754 -0.247512 -0.695427 -0.696779 -0.323835 0.183100 0.205764 0.206440 0.220071 0.193068 0.208322 0.206699 0.175782 0.222706 0.183824 0.184247 0.189486 0.182032 0.200211 0.193560 0.197438 0.193456 0.206581 0.185565 0.208342 0.216441 0.210223 0.208908 0.210377 0.215514 0.197852 0.205588 0.352160
chargesum: 0.00000
title: Mulliken charges with hydrogens summed into heavy atoms:
elementType: O O C C C C C C C C C C C C C
charge: -0.325469 -0.098510 0.236370 -0.055962 -0.050496 0.044790 0.032461 0.025793 0.020754 0.035291 0.033140 0.144633 -0.060422 -0.061980 0.079606
polarizability: 1.71860329e+02 -6.02663180e-03 1.48067993e+02 -5.69799366e-01 1.62549522e+00 1.29622803e+02
1716.lowfreq: -6.9656 -5.1952 -0.0009 -0.0006 -0.0003 4.8256 21.6539 24.1870 33.2972
frequency: 21.5605 23.8418 33.2636 37.5067 39.1992 48.9266 78.9011 88.7590 103.8840 116.4003 123.8410 128.2910 150.1716 189.7542 212.4367 220.0533 222.9078 226.5748 275.8566 303.8053 345.1631 369.6417 398.0000 439.8005 470.8813 494.3516 513.4567 639.4099 721.3226 726.2868 735.3101 750.2475 776.8838 826.9172 844.8193 872.2536 875.8201 890.9255 907.2702 936.6406 940.3929 984.7316 1001.3283 1006.0397 1017.4109 1029.3614 1052.0263 1063.3096 1069.2089 1073.0304 1081.7163 1092.1191 1098.6043 1122.4532 1135.8689 1164.3296 1188.6496 1200.6650 1202.0903 1212.9865 1222.3937 1241.9745 1258.1710 1263.1539 1279.3168 1283.3154 1284.8809 1287.8738 1292.1466 1306.3371 1318.1346 1327.1149 1329.0046 1348.4262 1351.9163 1355.5613 1369.7314 1375.0374 1384.7501 1387.2863 1388.2760 1449.1215 1460.8239 1461.9004 1463.3358 1464.3084 1467.3893 1469.5350 1471.3071 1475.0492 1476.1502 1480.0066 1481.6662 1487.8396 1488.9259 2905.7308 2937.5668 2949.6097 2949.9998 2957.9073 2965.5768 2966.6343 2967.0170 2967.9226 2971.1104 2971.3277 2975.1395 2977.9968 2990.4979 2991.2695 3004.4454 3008.3831 3016.0171 3021.2150 3027.7047 3045.2057 3050.9219 3067.5738 3067.7121 3069.8408 3071.0993 3078.6587 3532.4671
redmass: 4.6324 3.6675 3.4938 1.8833 1.8424 2.2121 2.6086 2.9781 3.1742 1.8356 2.1343 2.3071 2.9330 3.0235 2.7649 1.2673 1.1302 2.8062 2.4331 2.8263 3.2290 2.6272 2.9966 2.9597 1.2124 2.3294 2.5979 3.4807 1.1368 1.0718 1.3296 1.1517 1.5509 1.2793 1.3801 2.7802 2.3009 1.8687 1.9918 1.5457 1.3357 1.5207 3.3924 3.0197 1.8074 2.8717 3.4689 3.0418 1.9791 2.2499 2.2372 1.7175 1.8074 2.5693 1.9854 1.9942 1.2237 1.3865 1.4803 1.4247 1.2943 1.3363 1.2560 1.2519 1.2466 1.0976 1.0930 1.1169 1.1576 1.3177 1.2350 1.2650 1.3020 1.5452 1.6342 1.6250 1.5017 1.4247 1.2734 1.2192 1.2173 1.0817 1.0804 1.0866 1.0796 1.0677 1.0735 1.0730 1.0678 1.0437 1.0426 1.0729 1.0734 1.0883 1.0922 1.0826 1.0570 1.0590 1.0589 1.0635 1.0646 1.0625 1.0596 1.0622 1.0369 1.0374 1.0609 1.0600 1.0976 1.0960 1.1002 1.0996 1.0974 1.1031 1.1011 1.1039 1.1027 1.1007 1.1008 1.0993 1.0993 1.0969 1.0650
irintensity: 0.6530 1.4916 0.2587 0.1004 0.7260 0.1461 0.5955 0.4656 1.0911 0.0136 0.0031 1.1236 1.6828 0.8288 7.1998 0.1775 0.0033 3.0081 0.4627 0.7083 0.3174 2.4052 4.0565 1.7509 172.7316 17.2700 19.3359 2.4074 8.4818 6.5663 6.6540 0.3033 1.9130 1.8530 3.9615 18.6154 3.0048 9.6701 15.5268 13.4592 1.0825 7.7570 30.6560 53.5140 21.9481 1.0595 56.5449 21.2932 7.3093 0.1827 6.3041 2.6992 9.1024 17.2519 18.7721 8.4699 8.4545 3.4339 4.5273 8.2061 6.8832 12.9894 0.5002 0.2985 0.9182 0.9794 1.2817 0.9105 0.6982 9.4413 17.5241 13.3783 6.4778 0.4743 0.0386 2.1997 3.6530 2.9911 26.1133 12.4800 11.8860 3.1497 1.9225 7.8865 2.7767 0.0234 8.0903 1.3114 0.5791 12.2314 12.3382 3.2558 2.6235 19.4576 20.0741 49.2879 49.6881 7.6722 10.3044 8.7643 31.4162 5.3994 57.8474 88.2424 47.3054 20.6828 39.9722 84.6765 4.7125 7.1313 55.8302 47.8526 18.0699 3.1528 4.3657 82.8287 74.5939 70.8373 126.6487 55.4303 53.0403 44.0936 7.8265
temp: 298.150 k
press: 1.00000 atm
elementType: 8 8 6 6 6 6 6 6 6 6 6 6 6 6 6 1 1 1 1 1 1 1 1 1 1 1 1 1 1 1 1 1 1 1 1 1 1 1 1 1 1 1 1
symmnumber: 1
zpe: 1020871.4 jmol-1
zpe.correction: 0.388829 hartree
zpe.thermalcorrener: 0.409281 hartree
zpe.thermalcorrenthalpy: 0.410225 hartree
zpe.thermalcorrgfe: 0.335731 hartree
zpe.sumelectzpe: -661.329918 hartree
zpe.sumelectthermal: -661.309467 hartree
zpe.sumelectthermalent: -661.308523 hartree
zpe.sumelectthermalfe: -661.383016 hartree
dipole: -0.6273 -1.3711 2.6450
dipole: 3.0446
quadrupole: -99.6386 -99.9953 -97.5077
quadrupole: -3.3837 2.5847 8.4587
quadrupole: -0.5914 -0.9481 1.5395 -3.3837 2.5847 8.4587
hfenergy: -661.7187478 hartree
pointgroup: C01 [X(C13H28O2)]
dipole: 0.2768186 -0.5407124 -1.0323691 debye
polarizability: 171.850829|0.6369686|148.0582252|0.1339513|-1.7676084|129.6420715 unknown
InChI: InChI=1S/C13H28O2/c1-3-5-7-9-13(15-12-11-14)10-8-6-4-2/h13-14H,3-12H2,1-2H3
charge 0 multiplicity 1
43 atoms
O  0.093472 1.444829 -0.201305
O  -1.111269 3.252827 1.556177
C  0.166636 0.260255 -1.09193
C  -1.227138 -0.366246 -1.343953
C  1.172433 -0.695808 -0.425353
C  -1.993504 -0.788687 -0.070656
C  2.615594 -0.147038 -0.40205
C  -3.416816 -1.304538 -0.379593
C  3.614325 -1.100514 0.290706
C  -4.199084 -1.727798 0.884699
C  5.056709 -0.545718 0.330523
C  -0.59044 2.616541 -0.767493
C  -5.622738 -2.236246 0.570305
C  6.054077 -1.504306 1.016347
C  -0.479724 3.698455 0.310079
H  0.582889 0.598676 -2.070868
H  -1.851901 0.347464 -1.919202
H  -1.085642 -1.246056 -2.005104
H  0.837847 -0.896994 0.610959
H  1.146616 -1.663398 -0.966806
H  -2.054781 0.076495 0.619202
H  -1.430896 -1.578958 0.465638
H  2.953885 0.042739 -1.443088
H  2.613279 0.83298 0.11285
H  -3.356183 -2.16635 -1.077545
H  -3.986826 -0.513994 -0.912143
H  3.272368 -1.300448 1.327973
H  3.615017 -2.081514 -0.230288
H  -4.25696 -0.866167 1.580384
H  -3.63141 -2.51877 1.416482
H  5.055092 0.429397 0.858966
H  5.39524 -0.336821 -0.705105
H  -1.657639 2.388756 -0.968223
H  -0.100885 2.936256 -1.713928
H  -5.590752 -3.112708 -0.104488
H  -6.158419 -2.536764 1.489529
H  -6.222307 -1.451453 0.071327
H  6.102143 -2.473615 0.48469
H  5.751159 -1.710309 2.060448
H  7.074971 -1.080321 1.038408
H  0.590251 3.945053 0.475143
H  -1.019047 4.61082 0.00416
H  -0.752744 2.344096 1.736126
