program: Orca
programVersion: 5.0.3
charge: 1
multiplicity: 1
keywords: DLPNO-CCSD(T1) tightPNO Extrapolate(3/4,def2) RIJK def2/JK verytightSCF miniprint nopop
formula: C8H13
InChI: InChI=1/C8H13/c1-2-4-6-8-7-5-3-1/h1-2,7H,3-6,8H2
21 atoms
C  -1.998455 0.526662 0.119076
H  -2.177613 0.722737 1.179689
C  -1.965562 -1.000671 -0.168233
H  -2.67689 -1.595828 0.406205
C  -0.524007 -1.124004 0.278537
C  0.606881 -1.112528 -0.507481
C  1.906063 -0.647581 0.062583
H  2.003131 -0.953033 1.109803
H  2.757755 -1.045503 -0.495571
C  1.902481 0.918249 -0.030518
H  2.038547 1.215889 -1.076781
H  2.747279 1.324483 0.531841
C  0.561284 1.48059 0.487342
C  -0.538385 0.796335 -0.258334
H  0.528213 -1.295616 -1.578647
H  -2.085862 -1.214778 -1.234173
H  0.44721 1.368859 1.570588
H  -0.41722 0.86268 -1.342589
H  -2.705639 1.105076 -0.483318
H  0.511485 2.557203 0.261198
H  -0.37258 -1.073463 1.357919
e0: -310.326295878 hartree
corrType: DLPNO BASED
e0: -310.339889012 hartree
basis: def2-TZVPP def2-QZVPP
scfener: -310.326295878 -310.339889012
corrmethod: MDCI MDCI
correner: -1.452483637 -1.522599855
corrcbsextra: -1.574537755
energy: -311.916299067002
dipole: 0.56023 -0.75232 -0.19209 1.85220 -1.79297 0.05923 0.19305 -0.40050 -0.20745
magnitude: 0.28887 au
magnitude: 0.73424 debye
