program: Gaussian 09
title: 000051089
version: EM64L-G09RevD.01
frameworkgroup: C1[X(C6H16N2S)]
method: RPBEPBE
basis: SDD
operation: Freq
keyword: #p
keyword: freq=noraman
keyword: PBEPBE/SDD
title: #p freq=noraman PBEPBE/SDD
converged: YES YES NO NO
title: Mulliken charges:
elementType: S N N C C C C C C H H H H H H H H H H H H H H H H
charge: -0.043756 -0.572746 -0.571302 -0.358554 -0.366441 -0.069113 -0.358880 -0.742101 -0.391918 0.213285 0.185766 0.180930 0.188231 0.212901 0.218891 0.185165 0.294849 0.251996 0.177373 0.204174 0.278302 0.257698 0.271977 0.259738 0.093533
chargesum: 0.00000
title: Mulliken charges with hydrogens summed into heavy atoms:
elementType: S N N C C C C C C
charge: 0.049777 -0.036746 -0.039587 0.040498 0.002721 0.143788 0.045176 -0.195256 -0.010371
polarizability: 1.06854230e+02 -4.99214694e+00 9.75110412e+01 2.03306145e+00 -4.73403644e-01 8.12907769e+01
1716.lowfreq: -14.0951 -8.2812 -0.0021 -0.0005 0.0019 2.7696 38.7639 42.5536 79.3618
frequency: 38.6333 42.5007 79.3225 106.6377 112.9933 129.2615 168.5553 184.7281 202.1871 222.2287 253.8763 313.1124 371.3952 407.8089 450.3870 496.4063 600.6838 606.6253 682.9437 737.1230 766.4219 785.2573 845.5010 895.5076 957.5186 961.2679 1003.4268 1032.2239 1062.3518 1082.8757 1086.7072 1113.7645 1135.5320 1152.3321 1185.1328 1228.5320 1245.4469 1256.2088 1277.1530 1281.6277 1292.3030 1303.4341 1330.2184 1347.1925 1362.5228 1387.5116 1441.3771 1458.1752 1463.5351 1478.1112 1493.1069 1634.3116 1637.8627 2434.2402 2857.2685 2944.3529 2950.7874 2961.5764 2983.7806 2990.6286 3003.5997 3024.8198 3029.3095 3045.0979 3112.5982 3445.0516 3452.4491 3577.4274 3580.0670
redmass: 2.0455 3.1784 4.1408 2.2380 2.4324 2.0775 1.4891 1.5431 1.5026 1.4696 1.5792 3.4880 3.7667 2.8165 1.9913 2.5511 1.2895 1.5792 2.9727 1.1021 1.4408 1.2259 2.0004 1.2908 1.6421 1.8488 1.6442 2.5179 2.2480 2.1386 2.4107 2.1908 1.7403 1.3906 1.5173 1.3989 1.2843 1.3133 1.1019 1.1975 1.1732 1.2604 1.4035 1.5022 1.4177 1.4694 1.0866 1.0795 1.0716 1.0945 1.0903 1.0933 1.0944 1.0383 1.0717 1.0591 1.0635 1.0651 1.0829 1.0959 1.0855 1.0755 1.0837 1.1017 1.1045 1.0451 1.0448 1.0970 1.0975
irintensity: 1.9613 1.2901 0.4401 1.4680 1.2100 2.7631 29.7319 33.9241 28.0869 35.6332 26.3967 3.7956 18.4684 7.6916 18.3168 50.0754 199.7213 283.4660 24.0622 7.1657 5.5833 0.3292 3.9111 1.2749 8.9280 0.4077 1.5592 1.1419 12.4197 12.5097 5.1933 14.6730 17.6244 1.4555 8.2300 1.3566 10.8229 1.7796 0.1700 5.0366 3.7160 3.0360 8.4468 1.1005 5.4360 13.7829 9.8134 1.6631 0.5079 8.4151 4.8704 26.3678 40.6156 28.1756 114.9671 12.3525 18.8629 45.9127 32.1594 10.2830 35.6776 5.4491 19.7629 124.3475 13.0336 2.0848 1.7718 1.2596 0.1637
temp: 298.150 k
press: 1.00000 atm
elementType: 16 7 7 6 6 6 6 6 6 1 1 1 1 1 1 1 1 1 1 1 1 1 1 1 1
symmnumber: 1
zpe: 571724.8 jmol-1
zpe.correction: 0.217758 hartree
zpe.thermalcorrener: 0.230790 hartree
zpe.thermalcorrenthalpy: 0.231734 hartree
zpe.thermalcorrgfe: 0.177257 hartree
zpe.sumelectzpe: -745.002102 hartree
zpe.sumelectthermal: -744.989071 hartree
zpe.sumelectthermalent: -744.988127 hartree
zpe.sumelectthermalfe: -745.042604 hartree
dipole: -1.9873 1.1609 1.6083
dipole: 2.8078
quadrupole: -69.6803 -65.9371 -63.5719
quadrupole: 2.8397 -4.0080 -3.2358
quadrupole: -3.2839 0.4594 2.8245 2.8397 -4.0080 -3.2358
hfenergy: -745.2198608 hartree
pointgroup: C01 [X(C6H16N2S1)]
dipole: 0.7455198 -0.5797871 0.5730461 debye
dipolederiv: -0.3266045 0.0851778 -0.0307439 0.1067487 -0.2271013 -0.1174278 -0.0373063 -0.2030951 0.036128 -0.7841642 -0.2026122 0.076556 -0.163748 -0.8058856 -0.0409337 0.0487003 0.0482184 -0.1636641 -0.6271573 -0.1436052 0.1155463 -0.1398712 -0.2560698 0.0272649 0.1573796 0.0338123 -0.7307184 -0.1675387 -0.050911 0.0162754 -0.0272562 -0.0771262 0.0184485 0.0760558 0.0788038 0.1389528 -0.0614271 -0.0064777 -0.0075656 -0.0386231 0.1245685 0.0501262 0.0091271 0.0445899 0.148643 0.4090102 -0.1522134 -0.099309 0.1436606 0.5191208 0.0154272 -0.078577 -0.0264016 0.1606929 -0.0758684 -0.0224132 -0.0228738 0.0450098 0.1358465 0.0361168 -0.0678031 0.0632211 0.0884136 0.0061332 -0.038905 -0.0167371 -0.180316 0.3546027 0.0689152 -0.0181538 0.2141755 0.1549095 0.4779042 0.1484381 -0.1761262 0.1376695 0.2681247 -0.0354279 -0.0588017 0.0065727 0.4312422 0.1055262 -0.0294093 -0.0189447 -0.0213925 -0.1320962 -0.0218982 -0.0300103 -0.0371784 0.0573342 0.0254441 -0.0067524 -0.0176068 0.0072311 0.0635807 -0.0347448 -0.0144841 -0.0055884 -0.1849704 0.0624574 0.0200888 0.0070518 0.0430294 -0.1944111 -0.0201704 0.0068123 -0.0412053 0.0504292 0.0428289 -0.0017807 0.0140288 -0.0027179 0.058273 -0.016148 0.0088471 0.0062442 -0.198635 0.036984 0.0039455 -0.0085173 -0.0192179 0.0120982 -0.006395 0.0122212 -0.0014805 -0.1641273 0.0570761 -0.0027996 -0.0091653 -0.0026191 0.065942 -0.0126171 -0.0045161 -0.0032088 -0.1671042 0.0324719 0.0236115 0.0096013 0.0015968 -0.1923852 -0.0261673 -0.0036811 -0.0521052 0.0569666 -0.0914662 -0.0297819 0.02495 -0.0707079 -0.0523384 -0.0171778 0.0467689 -0.0109641 0.0664608 0.0978181 0.0273096 0.0390643 0.0396303 0.0349824 -0.0179216 -0.0279746 0.0015928 -0.1096185 -0.0634426 -0.0418124 0.0869848 -0.0261211 0.0279333 0.0012606 0.0829679 0.0546065 -0.3199012 0.0327782 0.0064035 0.0190869 0.0148256 -0.1923843 -0.0207681 0.0305588 -0.0536082 0.047485 0.1698995 0.2785342 -0.1064343 0.1371171 0.1545673 -0.026039 -0.0898631 -0.0560505 0.1410621 0.3311911 0.0963497 0.1060261 0.0598435 0.170213 0.0483015 0.0506219 -0.036187 0.0074981 -0.0188391 0.0200524 -0.0527253 -0.0011366 0.1529862 0.0690514 -0.1765357 0.0739201 0.2996375 0.1726626 0.0184674 0.0378558 -0.0255235 0.0036543 -0.0463582 0.025095 -0.1267583 0.2943435 0.1563226 0.0010954 0.0137218 -0.0171116 -0.0166957 0.1252825 0.0525509 0.0280741 -0.1414598 unknown
polarizability: 105.9890932|-5.4207807|98.0435113|-2.6578348|2.3953693|81.6234441 unknown
InChI: InChI=1S/C6H16N2S/c7-4-2-1-3-6(8)5-9/h6,9H,1-5,7-8H2
charge 0 multiplicity 1
25 atoms
S  -3.344488 1.907571 0.333705
N  -1.867821 -1.975745 -0.170437
N  4.524483 0.580637 -0.161162
C  -0.514873 0.188277 -0.295084
C  0.797666 -0.359338 0.306897
C  -1.786257 -0.543979 0.215936
C  2.050404 0.369622 -0.228141
C  -3.091496 0.126192 -0.274973
C  3.364395 -0.148816 0.390507
H  -0.604377 1.267899 -0.062323
H  -0.481163 0.102432 -1.403051
H  0.887904 -1.444218 0.086901
H  0.758353 -0.263748 1.413203
H  -1.785344 -0.51854 1.325256
H  2.117612 0.262097 -1.328007
H  1.954927 1.457443 -0.022876
H  -3.956933 -0.478637 0.0358
H  -3.10136 0.21613 -1.376361
H  3.279277 -0.091416 1.505334
H  3.483556 -1.220516 0.136732
H  -1.289216 -2.602058 0.396948
H  -1.728284 -2.136602 -1.174736
H  5.435895 0.185293 0.089191
H  4.490135 1.592348 0.002463
H  -3.563994 1.574773 1.661177
