program: Orca
programVersion: 5.0.3
elementType: C H C H C C C H H C H H C C H H H H H H H
charge: 1
multiplicity: 1
keywords: DSD-PBEP86 def2-TZVP D3BJ RIJCOSX verytightscf def2-TZVP/C def2/J soscf noTRAH
formula: C8H13
InChI: InChI=1/C8H13/c1-2-4-6-8-7-5-3-1/h1-2,7H,3-6,8H2
21 atoms
C  -1.998994 0.648378 0.076698
H  -2.176419 0.788326 1.149065
C  -1.781447 -0.953424 -0.171834
H  -2.636245 -1.430544 0.316524
C  -0.417797 -1.348188 0.370231
C  0.666143 -1.260135 -0.415347
C  1.969653 -0.706699 0.069632
H  2.156807 -0.938495 1.123204
H  2.83484 -1.034847 -0.516211
C  1.806884 0.83565 -0.116247
H  1.842001 1.094685 -1.180364
H  2.623495 1.372752 0.373924
C  0.452701 1.370797 0.502997
C  -0.729946 1.238968 -0.331109
H  0.518612 -1.215833 -1.498083
H  -1.845447 -1.142218 -1.247287
H  0.286968 0.98212 1.509764
H  -0.640085 1.596152 -1.362083
H  -2.850787 0.988791 -0.517285
H  0.595735 2.471539 0.577232
H  -0.313246 -1.414257 1.453467
totalener: -311.12165746 hartree
nucrepener: 379.45671586 hartree
electener: -690.57837332 hartree
oneelecener: -1159.35730834 hartree
twoeener: 468.77893502 hartree
kineticenergy: 310.00616077 hartree
exchangeener: -13.666864473265 hartree
correlationener: -0.921533506537 hartree
xcener: -14.588397979802 hartree
chargesum: 1.0000000
charge: -0.225562 0.184175 -0.215199 0.180491 -0.186923 -0.135897 -0.207078 0.153939 0.163786 -0.259016 0.153064 0.172576 -0.154026 0.118398 0.146395 0.174177 0.162378 0.218562 0.186132 0.204829 0.164798
charge: -0.182323 0.168002 -0.167147 0.152662 -0.148142 -0.144140 -0.219406 0.149313 0.151495 -0.192833 0.143820 0.150418 -0.204959 0.193056 0.151332 0.151848 0.160798 0.176362 0.160445 0.200321 0.149077
qa: -0.2256 0.1842 -0.2152 0.1805 -0.1869 -0.1359 -0.2071 0.1539 0.1638 -0.2590 0.1531 0.1726 -0.1540 0.1184 0.1464 0.1742 0.1624 0.2186 0.1861 0.2048 0.1648
va: 3.8566 0.9629 3.8524 0.9652 3.8681 3.8456 3.8810 0.9730 0.9721 3.8926 0.9686 0.9634 3.8301 3.4857 0.9675 0.9663 0.9810 0.9372 0.9669 0.9529 0.9652
total: -311.791121821 hartree
dispcorr: -0.011828464 hartree
energy: -311.802950285167
dipole: 0.37113 -1.07356 -0.70243 1.98305 -0.54789 1.43515 0.17024 -0.35230 -0.18205
magnitude: 1.60817 au
magnitude: 4.08765 debye
