program: Orca
programVersion: 5.0.3
elementType: C H C H C C C H H C H H C C H H H H H H H
charge: 1
multiplicity: 1
keywords: DSD-PBEP86 cc-pVTZ EnGrad D3BJ RIJCOSX verytightscf cc-pVTZ/C def2/J soscf
formula: C8H13
InChI: InChI=1/C8H12.H/c1-2-4-6-8-7-5-3-1;/h1-2,7-8H,3-6H2;
21 atoms
C  -1.975895 0.654195 0.123672
H  -2.128938 0.845525 1.190479
C  -1.84993 -0.948827 -0.119685
H  -2.653018 -1.441019 0.431969
C  -0.469466 -1.348259 0.373103
C  0.673167 -1.25893 -0.384773
C  1.975845 -0.654956 0.111444
H  2.132229 -0.855651 1.176088
H  2.844913 -1.012569 -0.443786
C  1.85024 0.949246 -0.116833
H  1.971476 1.172964 -1.181468
H  2.654309 1.437215 0.437225
C  0.470771 1.343457 0.383942
C  -0.674991 1.261303 -0.371854
H  0.550055 -1.266483 -1.471257
H  -1.974319 -1.162023 -1.186031
H  0.000526 0.003063 0.002563
H  -0.554812 1.27493 -1.458288
H  -2.84659 1.015819 -0.426194
H  0.351345 1.334244 1.467929
H  -0.345914 -1.341309 1.460072
totalener: -311.07464078 hartree
nucrepener: 382.90672897 hartree
electener: -693.98136976 hartree
oneelecener: -1165.67143315 hartree
twoeener: 471.69006339 hartree
kineticenergy: 309.66678289 hartree
exchangeener: -13.660033581136 hartree
correlationener: -0.927805915768 hartree
xcener: -14.587839496903 hartree
chargesum: 1.0000000
charge: -0.258434 0.172293 -0.257298 0.187333 -0.059727 -0.058713 -0.257983 0.172191 0.186326 -0.256832 0.171493 0.187234 -0.060776 -0.057410 0.186664 0.171447 0.082575 0.187069 0.186613 0.188969 0.186965
charge: 0.110484 -0.003538 0.110476 0.001829 0.138919 0.140136 0.110015 -0.003525 0.001775 0.110772 -0.003558 0.001935 0.141665 0.142191 0.003158 -0.003687 -0.010245 0.003520 0.001793 0.002293 0.003591
qa: -0.2584 0.1723 -0.2573 0.1873 -0.0597 -0.0587 -0.2580 0.1722 0.1863 -0.2568 0.1715 0.1872 -0.0608 -0.0574 0.1867 0.1714 0.0826 0.1871 0.1866 0.1890 0.1870
va: 3.9027 0.9814 3.9011 0.9733 3.8036 3.8046 3.9029 0.9814 0.9739 3.9007 0.9821 0.9734 3.8025 3.8032 0.9825 0.9821 1.1516 0.9825 0.9739 0.9819 0.9825
dispcorr: -0.012014778 hartree
energy: -311.791762288164
dipole: 0.00139 -0.00267 -0.00128 0.00760 0.00327 0.01087 0.00074 -0.00212 -0.00137
magnitude: 0.01103 au
magnitude: 0.02803 debye
