program: Gaussian 09
title: 000051112
version: EM64L-G09RevD.01
frameworkgroup: C1[X(C10H13N3O3)]
method: RPBEPBE
basis: SDD
operation: Freq
keyword: #p
keyword: freq=noraman
keyword: PBEPBE/SDD
title: #p freq=noraman PBEPBE/SDD
converged: YES YES NO NO
title: Mulliken charges:
elementType: O O O N N N C C C C C C C C C C H H H H H H H H H H H H H
charge: -0.287760 -0.303296 -0.282427 -0.326065 -0.029191 0.051643 0.474339 -0.429078 -0.434848 -0.382919 -0.382032 0.327759 -0.223543 -0.223831 -0.230121 -0.593568 0.233179 0.233722 0.257022 0.282224 0.234567 0.234343 0.350444 0.229667 0.229194 0.231595 0.234407 0.272030 0.252546
chargesum: 0.00000
title: Mulliken charges with hydrogens summed into heavy atoms:
elementType: O O O N N N C C C C C C C C C C
charge: -0.287760 -0.303296 -0.282427 0.024379 -0.029191 0.051643 0.474339 0.037823 0.104398 -0.148353 -0.147688 0.327759 0.006124 0.005362 0.001474 0.165414
polarizability: 1.77705602e+02 -1.57066473e+01 1.26651952e+02 1.10911469e+01 4.28526480e+00 1.14492609e+02
1716.lowfreq: -25.9674 -5.2852 0.0007 0.0008 0.0009 2.7009 4.6999 12.1454 35.4247
frequency: -20.1272 11.5654 35.2702 49.2259 65.3286 69.6820 120.9117 154.9898 159.5946 194.4494 236.8260 242.8255 311.0545 319.4685 346.9495 376.3097 402.4058 412.0079 501.8769 552.4559 570.2703 616.4970 618.0811 628.4498 676.6180 703.1369 706.1500 759.2260 813.3184 833.0910 853.8826 868.3491 917.7211 933.4433 947.9173 963.7568 977.7720 991.2543 998.5906 1018.5065 1026.3424 1088.3323 1112.5944 1119.8156 1173.5779 1183.3661 1188.5061 1193.2038 1206.4144 1227.4733 1237.8274 1321.4789 1325.3578 1342.9362 1354.9114 1385.9918 1394.4820 1425.0031 1428.6063 1439.6686 1462.5709 1473.6269 1479.8281 1487.6601 1488.9474 1596.4731 1617.1729 1641.2311 2986.7190 3014.9441 3049.8825 3075.8776 3079.1565 3120.9222 3123.1695 3123.2529 3125.2607 3137.2714 3150.1670 3166.0804 3570.4549
redmass: 4.2320 4.0133 8.0830 4.8550 5.4492 5.5425 5.5114 2.4247 1.6702 3.1756 4.8744 9.8119 4.8175 2.2101 5.6186 2.0501 2.7951 4.7616 4.0000 4.4408 2.8905 6.0740 1.5791 4.5758 4.3220 1.7371 11.6847 1.9595 4.0957 5.1183 1.2472 3.9171 5.0687 1.6657 1.6217 3.0728 1.3931 6.0887 1.3291 2.3589 2.1781 1.5156 5.2255 1.3219 1.0538 1.7093 1.2386 1.0907 3.3886 2.4097 2.4148 8.3501 1.2745 1.4828 1.3985 8.7457 1.1844 1.1122 1.1805 2.1835 1.0498 1.2055 1.5817 2.0225 1.1689 6.1297 6.1906 8.7216 1.0345 1.0577 1.0588 1.1009 1.1081 1.1015 1.0855 1.1052 1.0884 1.0920 1.0964 1.1017 1.0779
irintensity: 0.2023 0.2226 4.0996 1.9785 5.8538 9.7129 1.4120 4.6508 2.3540 2.7183 1.1432 10.7449 5.3869 1.1106 5.9828 12.5007 0.0018 4.6720 20.4089 20.0329 18.6543 0.6510 87.0443 11.4593 16.1939 54.5045 18.4344 71.7587 10.5196 21.1267 0.0167 10.9836 254.9090 2.3943 2.0120 165.1993 0.0066 0.9603 0.0370 18.1999 2.7419 7.3678 76.0248 6.6159 0.0057 248.4022 49.9956 1.1787 106.2930 16.6960 187.3832 82.0825 0.2510 47.3658 8.9589 0.4667 5.0649 29.0577 33.0046 9.3656 8.7105 114.3337 257.6685 29.8050 34.4379 0.6910 0.0740 245.0181 32.7857 21.8268 18.0423 15.7823 13.6374 4.8472 4.8714 0.4757 2.3154 14.5007 39.0497 19.4114 47.6820
temp: 298.150 k
press: 1.00000 atm
elementType: 8 8 8 7 7 7 6 6 6 6 6 6 6 6 6 6 1 1 1 1 1 1 1 1 1 1 1 1 1
symmnumber: 1
zpe: 592784.3 jmol-1
zpe.correction: 0.225780 hartree
zpe.thermalcorrener: 0.240870 hartree
zpe.thermalcorrenthalpy: 0.241815 hartree
zpe.thermalcorrgfe: 0.180388 hartree
zpe.sumelectzpe: -777.539319 hartree
zpe.sumelectthermal: -777.524228 hartree
zpe.sumelectthermalent: -777.523284 hartree
zpe.sumelectthermalfe: -777.584711 hartree
dipole: -1.5280 -2.2377 0.0235
dipole: 2.7098
quadrupole: -81.8996 -104.5665 -86.7484
quadrupole: -16.2002 2.0437 4.5908
quadrupole: 9.1719 -13.4950 4.3231 -16.2002 2.0437 4.5908
hfenergy: -777.7650989 hartree
pointgroup: C01 [X(C10H13N3O3)]
dipole: 0.5955209 0.7952491 0.3866984 debye
polarizability: 175.7667063|-6.322225|126.8741673|-21.4183763|2.4170252|116.2092893 unknown
InChI: InChI=1S/C10H13N3O3/c1-13(12-15)8-11-10(14)16-7-9-5-3-2-4-6-9/h2-6,11H,7-8H2,1H3
charge 0 multiplicity 1
29 atoms
O  0.370832 0.2521 -0.141122
O  -1.189073 1.288788 1.296933
O  -3.793666 -2.013574 -1.37581
N  -1.83915 0.202327 -0.680487
N  -3.920548 -0.60655 0.361294
N  -4.181768 -1.862437 -0.150621
C  2.766871 0.153125 0.239327
C  1.467668 0.676531 0.79773
C  -3.262421 0.430177 -0.479189
C  3.243855 -1.128855 0.611576
C  3.528342 0.934912 -0.665571
C  -0.916193 0.636939 0.251767
C  4.457976 -1.623818 0.08626
C  4.742916 0.443428 -1.193251
C  5.210167 -0.837767 -0.817682
C  -4.263967 -0.371228 1.772294
H  1.237674 0.262124 1.795152
H  1.448084 1.778672 0.862866
H  -3.404944 1.395772 0.029135
H  -3.760284 0.424994 -1.462596
H  2.660617 -1.740205 1.310787
H  3.166415 1.928041 -0.958193
H  -1.537543 -0.422095 -1.430055
H  4.817621 -2.615857 0.380737
H  5.323848 1.056055 -1.891436
H  6.153599 -1.219333 -1.224031
H  -5.055302 0.395424 1.863479
H  -3.372507 -0.030512 2.326519
H  -4.630719 -1.32228 2.189487
