program: Orca
programVersion: 5.0.3
elementType: C H C H C C C H H C H H C C H H H H H H H
charge: 1
multiplicity: 1
keywords: DSD-PBEP86 def2-TZVP D3BJ RIJCOSX verytightscf def2-TZVP/C def2/J soscf noTRAH
formula: C8H13
InChI: InChI=1/C8H13/c1-2-4-6-8-7-5-3-1/h1-2,7H,3-6,8H2
21 atoms
C  -1.994127 0.608547 0.082701
H  -2.172109 0.775426 1.151573
C  -1.810828 -0.953487 -0.171905
H  -2.64514 -1.468845 0.312898
C  -0.431387 -1.322684 0.359378
C  0.657064 -1.248075 -0.429888
C  1.954721 -0.701746 0.07172
H  2.130073 -0.942247 1.125348
H  2.821724 -1.034348 -0.509255
C  1.817333 0.844649 -0.107612
H  1.856306 1.102733 -1.171999
H  2.644689 1.366595 0.381289
C  0.471331 1.401352 0.507884
C  -0.70269 1.198012 -0.325473
H  0.523247 -1.246903 -1.514297
H  -1.868134 -1.147837 -1.2476
H  0.31711 1.050983 1.530866
H  -0.612333 1.52826 -1.365368
H  -2.831999 0.990274 -0.508673
H  0.617226 2.501969 0.532884
H  -0.31544 -1.372397 1.442889
totalener: -311.12555699 hartree
nucrepener: 379.93423285 hartree
electener: -691.05978984 hartree
oneelecener: -1160.29863796 hartree
twoeener: 469.23884812 hartree
kineticenergy: 310.01028237 hartree
exchangeener: -13.667616887496 hartree
correlationener: -0.921865717041 hartree
xcener: -14.589482604537 hartree
chargesum: 1.0000000
charge: -0.209410 0.178274 -0.214013 0.177486 -0.175069 -0.143309 -0.210358 0.155130 0.164813 -0.252443 0.152210 0.173423 -0.158626 0.108376 0.155089 0.168664 0.162227 0.216062 0.183021 0.203764 0.164691
charge: -0.189863 0.165585 -0.184731 0.151669 -0.128880 -0.140649 -0.219759 0.149825 0.152843 -0.192652 0.144193 0.150429 -0.208840 0.201399 0.152556 0.152490 0.159590 0.175627 0.161029 0.197371 0.150767
qa: -0.2094 0.1783 -0.2140 0.1775 -0.1751 -0.1433 -0.2104 0.1551 0.1648 -0.2524 0.1522 0.1734 -0.1586 0.1084 0.1551 0.1687 0.1622 0.2161 0.1830 0.2038 0.1647
va: 3.8459 0.9651 3.8568 0.9674 3.8700 3.8462 3.8872 0.9726 0.9718 3.8829 0.9696 0.9630 3.8415 3.4893 0.9659 0.9698 0.9791 0.9375 0.9675 0.9545 0.9646
total: -311.795013137 hartree
dispcorr: -0.011853865 hartree
energy: -311.806867001436
dipole: 0.43584 -1.05090 -0.61506 1.96943 -0.62837 1.34106 0.15025 -0.32977 -0.17952
magnitude: 1.48626 au
magnitude: 3.77777 debye
