program: Orca
programVersion: 5.0.3
elementType: C H C H C C C H H C H H C C H H H H H H H
charge: 1
multiplicity: 1
keywords: b3lyp cc-pVTZ EnGrad RIJCOSX verytightscf cc-pVTZ/C def2/J soscf
formula: C8H13
InChI: InChI=1/C8H13/c1-2-4-6-8-7-5-3-1/h1-2,7H,3-6,8H2
21 atoms
C  -1.999365 0.520195 0.11088
H  -2.18419 0.731418 1.167477
C  -1.987942 -1.009867 -0.15866
H  -2.680401 -1.603076 0.439578
C  -0.537845 -1.092066 0.274575
C  0.59594 -1.085285 -0.516173
C  1.903569 -0.636656 0.052537
H  1.997833 -0.958577 1.095104
H  2.744245 -1.044876 -0.514515
C  1.921915 0.93034 -0.01493
H  2.086524 1.245051 -1.051811
H  2.756364 1.315442 0.576963
C  0.569149 1.476026 0.481874
C  -0.514548 0.734819 -0.248434
H  0.515002 -1.281148 -1.584761
H  -2.121999 -1.242426 -1.218818
H  0.456827 1.38406 1.567419
H  -0.404354 0.814829 -1.3333
H  -2.677603 1.114986 -0.507184
H  0.483785 2.543482 0.232502
H  -0.381048 -1.045872 1.353049
totalener: -312.25246804 hartree
nucrepener: 387.08395102 hartree
electener: -699.33641906 hartree
oneelecener: -1174.96841553 hartree
twoeener: 475.63199647 hartree
kineticenergy: 310.01858146 hartree
exchangeener: -36.331812028679 hartree
correlationener: -2.310356319268 hartree
xcener: -38.642168347947 hartree
chargesum: 1.0000000
charge: -0.158053 0.140453 -0.181160 0.154800 -0.017657 -0.014577 -0.187598 0.136302 0.155168 -0.191812 0.134722 0.151597 -0.172539 -0.055625 0.189705 0.139230 0.131455 0.164512 0.152916 0.161753 0.166407
charge: 0.109958 -0.001852 0.111712 -0.002686 0.119258 0.183385 0.090109 0.001279 0.006003 0.101846 -0.007371 -0.001047 0.071193 0.193030 0.003106 -0.002240 -0.004160 0.002427 -0.003090 0.017107 0.012032
qa: -0.1581 0.1405 -0.1812 0.1548 -0.0177 -0.0146 -0.1876 0.1363 0.1552 -0.1918 0.1347 0.1516 -0.1725 -0.0556 0.1897 0.1392 0.1315 0.1645 0.1529 0.1618 0.1664
va: 3.8233 0.9922 3.8442 0.9836 3.7548 3.7314 3.8723 0.9899 0.9831 3.8449 0.9870 0.9811 3.8466 3.7073 0.9759 0.9925 0.9919 0.9963 0.9814 0.9767 0.9940
energy: -312.252468038054
dipole: 0.55382 -0.66447 -0.11065 1.84712 -1.89694 -0.04982 0.20763 -0.37432 -0.16669
magnitude: 0.20618 au
magnitude: 0.52408 debye
