program: Orca
programVersion: 5.0.3
elementType: C H C H C C C H H C H H C C H H H H H H H
charge: 1
multiplicity: 1
keywords: DSD-PBEP86/2013 cc-pVTZ EnGrad RIJCOSX verytightscf cc-pVTZ/C def2/J soscf
formula: C8H13
InChI: InChI=1/C8H13/c1-2-4-6-8-7-5-3-1/h1-2,7H,3-6,8H2
21 atoms
C  -1.988532 0.663241 0.110941
H  -2.168471 0.854789 1.173318
C  -1.835891 -0.938783 -0.127519
H  -2.647463 -1.438467 0.404418
C  -0.460823 -1.338623 0.387067
C  0.682251 -1.267434 -0.373005
C  1.9903 -0.663297 0.099357
H  2.174522 -0.864584 1.159207
H  2.847697 -1.011216 -0.479604
C  1.837088 0.939035 -0.125473
H  1.934257 1.161892 -1.192754
H  2.647828 1.436986 0.409406
C  0.460952 1.329959 0.395301
C  -0.685187 1.275282 -0.361827
H  0.544876 -1.258348 -1.457886
H  -1.935697 -1.15181 -1.196538
H  0.001485 0.000414 0.069903
H  -0.553743 1.284371 -1.447328
H  -2.849771 1.013061 -0.461097
H  0.348686 1.328201 1.482457
H  -0.346488 -1.354411 1.473981
totalener: -311.10121756 hartree
nucrepener: 382.88822139 hartree
electener: -693.98943895 hartree
oneelecener: -1165.63561474 hartree
twoeener: 471.64617579 hartree
kineticenergy: 309.66315029 hartree
exchangeener: -12.749343266079 hartree
correlationener: -0.949497713166 hartree
xcener: -13.698840979245 hartree
chargesum: 1.0000000
charge: -0.259948 0.175382 -0.263537 0.189067 -0.065566 -0.054672 -0.259610 0.175129 0.188204 -0.263175 0.172722 0.188969 -0.065716 -0.054618 0.186804 0.172896 0.078530 0.187628 0.188243 0.191373 0.191895
charge: 0.108315 -0.002849 0.111008 0.002050 0.134081 0.145598 0.108328 -0.002914 0.002536 0.111100 -0.003379 0.001979 0.133513 0.146879 0.003709 -0.003347 -0.011080 0.003463 0.002603 0.004407 0.004002
qa: -0.2599 0.1754 -0.2635 0.1891 -0.0656 -0.0547 -0.2596 0.1751 0.1882 -0.2632 0.1727 0.1890 -0.0657 -0.0546 0.1868 0.1729 0.0785 0.1876 0.1882 0.1914 0.1919
va: 3.9003 0.9801 3.9068 0.9727 3.8009 3.8058 3.9002 0.9803 0.9730 3.9068 0.9816 0.9728 3.8016 3.8049 0.9819 0.9815 1.1535 0.9814 0.9730 0.9812 0.9808
energy: -311.817151356185
dipole: -0.00210 -0.00169 -0.00378 0.00156 0.00005 0.00161 -0.05811 0.04927 -0.00884
magnitude: 0.00975 au
magnitude: 0.02479 debye
