program: Orca
programVersion: 5.0.3
elementType: C H C H C C C H H C H H C C H H H H H H H
charge: 1
multiplicity: 1
keywords: PBE0 def2-TZVP EnGrad RIJCOSX verytightscf def2/J soscf
formula: C8H13
InChI: InChI=1/C8H13/c1-2-4-6-8-7-5-3-1/h1-2,7H,3-6,8H2
21 atoms
C  -1.994127 0.608547 0.082701
H  -2.172109 0.775426 1.151573
C  -1.810828 -0.953487 -0.171905
H  -2.64514 -1.468845 0.312898
C  -0.431387 -1.322684 0.359378
C  0.657064 -1.248075 -0.429888
C  1.954721 -0.701746 0.07172
H  2.130073 -0.942247 1.125348
H  2.821724 -1.034348 -0.509255
C  1.817333 0.844649 -0.107612
H  1.856306 1.102733 -1.171999
H  2.644689 1.366595 0.381289
C  0.471331 1.401352 0.507884
C  -0.70269 1.198012 -0.325473
H  0.523247 -1.246903 -1.514297
H  -1.868134 -1.147837 -1.2476
H  0.31711 1.050983 1.530866
H  -0.612333 1.52826 -1.365368
H  -2.831999 0.990274 -0.508673
H  0.617226 2.501969 0.532884
H  -0.31544 -1.372397 1.442889
totalener: -312.05325972 hartree
nucrepener: 379.93423285 hartree
electener: -691.98749256 hartree
oneelecener: -1160.92275736 hartree
twoeener: 468.93526479 hartree
kineticenergy: 310.15721431 hartree
exchangeener: -34.169571300713 hartree
correlationener: -1.962221386958 hartree
xcener: -36.131792687671 hartree
chargesum: 1.0000000
charge: -0.194449 0.177655 -0.216404 0.176553 -0.156533 -0.116119 -0.215901 0.160147 0.170337 -0.256852 0.160317 0.176078 -0.143198 0.035322 0.153611 0.170193 0.162934 0.205544 0.182089 0.205580 0.163096
charge: -0.198665 0.171150 -0.192741 0.156789 -0.117261 -0.136334 -0.225034 0.156664 0.162615 -0.198016 0.151844 0.157188 -0.215830 0.139969 0.159078 0.158673 0.164589 0.175287 0.166759 0.207128 0.156147
qa: -0.1944 0.1777 -0.2164 0.1766 -0.1565 -0.1161 -0.2159 0.1601 0.1703 -0.2569 0.1603 0.1761 -0.1432 0.0353 0.1536 0.1702 0.1629 0.2055 0.1821 0.2056 0.1631
va: 3.8972 0.9660 3.8970 0.9672 3.9444 3.9049 3.9367 0.9701 0.9702 3.9548 0.9671 0.9620 3.8928 3.7063 0.9654 0.9700 0.9780 0.9434 0.9672 0.9541 0.9638
energy: -312.053259715383
dipole: 0.43584 -0.91173 -0.47589 1.96943 -0.81786 1.15157 0.15025 -0.27319 -0.12294
magnitude: 1.25208 au
magnitude: 3.18252 debye
