program: Gaussian 09
title: 000051109
version: EM64L-G09RevD.01
frameworkgroup: C1[X(C11H15N3O3)]
method: RPBEPBE
basis: SDD
operation: Freq
keyword: #p
keyword: freq=noraman
keyword: PBEPBE/SDD
title: #p freq=noraman PBEPBE/SDD
converged: YES YES NO NO
title: Mulliken charges:
elementType: O O O N N N C C C C C C C C C C C H H H H H H H H H H H H H H H
charge: -0.291019 -0.308764 -0.280772 -0.036863 -0.332651 0.063983 -0.559519 0.485182 -0.427058 -0.370047 -0.367896 -0.239988 -0.223238 -0.238254 0.346451 -0.220348 -0.673480 0.226715 0.246808 0.255235 0.276952 0.251267 0.252874 0.344872 0.231047 0.228055 0.229569 0.227998 0.229616 0.232223 0.230003 0.211048
chargesum: 0.00000
title: Mulliken charges with hydrogens summed into heavy atoms:
elementType: O O O N N N C C C C C C C C C C C
charge: -0.291019 -0.308764 -0.280772 -0.036863 0.012221 0.063983 -0.085996 0.485182 0.105129 -0.118780 -0.115023 -0.008940 0.004817 -0.008685 0.346451 0.237267 -0.000206
polarizability: 1.46478380e+02 -2.77650054e+01 1.53109178e+02 -1.19457649e+01 1.92336987e+00 1.34868054e+02
1716.lowfreq: -9.4629 -1.8897 -0.0007 -0.0004 0.0004 1.6354 10.4925 15.2336 37.4135
frequency: 8.9533 14.6975 37.3859 47.1589 51.1432 64.3205 93.9498 121.3631 130.7452 177.1482 218.3012 247.7571 258.5611 296.2732 316.6470 341.3623 367.8145 389.4402 404.0145 424.2623 467.3553 549.8546 584.7981 615.6811 629.5894 647.3287 682.3091 704.1708 704.7171 762.0342 802.2425 808.4638 822.7681 831.5670 852.1529 900.8646 912.1697 928.8723 977.0251 988.5855 991.8487 997.6811 1026.9325 1028.4033 1065.7604 1099.9477 1110.5517 1129.2957 1139.3680 1173.0403 1175.3881 1191.6919 1199.7429 1208.9693 1250.3206 1269.7457 1320.0971 1332.8088 1345.8168 1347.7691 1359.9669 1384.9647 1396.7563 1400.4035 1427.0575 1443.7425 1452.7506 1462.6712 1474.9256 1482.2051 1484.5243 1493.4298 1595.8167 1612.7833 1647.5900 2996.3130 3008.1478 3019.2141 3040.5516 3067.1917 3082.2078 3093.1774 3107.8509 3117.6200 3120.9098 3127.9150 3139.8258 3150.8455 3164.8710 3571.3167
redmass: 4.3923 4.7556 3.0469 4.6453 2.8365 5.5255 8.1542 3.6201 4.4006 5.3446 5.4216 1.2373 5.4994 4.3577 6.3500 4.0179 3.1241 1.8540 2.7974 4.5008 3.6925 3.4610 4.4411 6.0231 1.3063 3.9044 5.4219 11.1809 1.6346 2.2620 1.0968 3.9529 3.2645 4.1903 1.2660 2.1250 3.5298 1.6265 1.3959 4.2569 4.3322 1.3572 2.2549 2.5436 2.1577 1.6938 2.5206 4.3674 1.4598 1.0556 2.7169 1.2032 2.1499 2.8590 1.1326 1.8692 1.7309 1.3341 2.2159 1.3183 1.3381 5.0419 1.2873 1.2658 1.0993 2.1439 1.1201 1.0402 1.1416 1.3399 2.1534 1.2722 6.0567 5.9586 8.9158 1.0358 1.0580 1.0588 1.0601 1.1070 1.1046 1.0985 1.1026 1.1035 1.0860 1.0874 1.0919 1.0963 1.1015 1.0778
irintensity: 1.7330 0.4320 1.2588 1.8538 1.0113 1.1300 10.2944 4.3147 4.9601 2.4345 4.4263 1.1630 6.3057 3.4462 1.1914 6.9861 3.9969 6.6360 0.0330 2.8181 9.4942 8.7389 22.0556 3.6475 135.5453 20.7014 3.0129 25.9741 75.7678 24.5573 3.9351 0.3838 11.0176 42.2497 1.5476 52.3782 66.1067 9.0810 0.7879 76.7471 36.3706 1.8413 2.0605 102.2286 49.5046 10.6197 21.4247 62.5606 4.5214 0.8035 12.4573 27.3487 305.1039 12.5478 0.2577 74.9549 59.9859 33.7334 34.5400 19.1975 0.1399 1.0619 7.6498 25.9495 43.2701 6.7110 19.2617 11.3401 76.5864 124.3466 8.1275 103.1338 0.9967 1.2290 209.4756 20.3610 20.8376 23.8492 19.6485 10.2903 5.9237 28.2794 43.9489 2.0687 1.6863 0.6712 15.8289 29.6011 16.6058 44.9416
temp: 298.150 k
press: 1.00000 atm
elementType: 8 8 8 7 7 7 6 6 6 6 6 6 6 6 6 6 6 1 1 1 1 1 1 1 1 1 1 1 1 1 1 1
symmnumber: 1
zpe: 667017.2 jmol-1
zpe.correction: 0.254053 hartree
zpe.thermalcorrener: 0.271288 hartree
zpe.thermalcorrenthalpy: 0.272232 hartree
zpe.thermalcorrgfe: 0.204515 hartree
zpe.sumelectzpe: -816.765938 hartree
zpe.sumelectthermal: -816.748704 hartree
zpe.sumelectthermalent: -816.747760 hartree
zpe.sumelectthermalfe: -816.815476 hartree
dipole: -2.0493 1.8889 1.1691
dipole: 3.0223
quadrupole: -95.0008 -99.2035 -101.9713
quadrupole: 1.2489 8.4317 -8.5762
quadrupole: 3.7244 -0.4783 -3.2461 1.2489 8.4317 -8.5762
hfenergy: -817.0199917 hartree
pointgroup: C01[X(C11H15N3O3)]
dipole: -0.3794349 -1.0331295 -0.4500243 debye
polarizability: 127.7470806|9.8393784|175.3959617|11.2982434|8.5831894|131.3125705 unknown
InChI: InChI=1S/C11H15N3O3/c1-2-17-11(15)12-9-14(13-16)8-10-6-4-3-5-7-10/h3-7,12H,2,8-9H2,1H3
charge 0 multiplicity 1
32 atoms
O  -2.655125 -0.687392 0.900618
O  -2.110664 -0.249705 -1.352112
O  0.409581 3.393541 1.515054
N  0.548121 2.216745 -0.391824
N  -1.598944 1.255583 0.377823
N  1.200801 2.861896 0.643699
C  1.423871 1.453785 -1.317166
C  1.627599 -0.005926 -0.914372
C  -0.937008 2.227471 -0.477223
C  1.021702 -1.055771 -1.645602
C  2.44888 -0.318851 0.19964
C  1.240982 -2.402903 -1.275283
C  2.666409 -1.663104 0.57099
C  2.064909 -2.70964 -0.168757
C  -2.113703 0.08014 -0.135814
C  -3.226155 -2.002637 0.486878
C  -3.782901 -2.651484 1.749831
H  0.989545 1.522443 -2.329573
H  2.391223 1.986983 -1.314891
H  -1.213624 2.010692 -1.520331
H  -1.255171 3.243783 -0.189541
H  0.362103 -0.822796 -2.488871
H  2.911631 0.493145 0.774101
H  -1.638814 1.420818 1.384511
H  0.768368 -3.207432 -1.849538
H  3.304518 -1.895901 1.430828
H  2.237651 -3.753572 0.116608
H  -4.005608 -1.823253 -0.275543
H  -2.419389 -2.600648 0.025169
H  -2.987356 -2.800938 2.499574
H  -4.573039 -2.025898 2.199019
H  -4.217793 -3.636972 1.502097
