program: Orca
programVersion: 5.0.3
elementType: C H C H C C C H H C H H C C H H H H H H H
charge: 1
multiplicity: 1
keywords: b3lyp cc-pVTZ EnGrad RIJCOSX verytightscf cc-pVTZ/C def2/J soscf
formula: C8H13
InChI: InChI=1/C8H13/c1-2-4-6-8-7-5-3-1/h1-2,7H,3-6,8H2
21 atoms
C  -1.990473 0.580972 0.092471
H  -2.167575 0.758415 1.159111
C  -1.840673 -0.962929 -0.173537
H  -2.654605 -1.500568 0.320914
C  -0.448346 -1.293938 0.344484
C  0.645798 -1.229742 -0.446631
C  1.939218 -0.693279 0.072625
H  2.098138 -0.944513 1.126462
H  2.807627 -1.036108 -0.499825
C  1.829332 0.856911 -0.095351
H  1.876717 1.117601 -1.159066
H  2.667749 1.358943 0.395831
C  0.492909 1.43115 0.511284
C  -0.670998 1.140116 -0.318167
H  0.526943 -1.277188 -1.53067
H  -1.902919 -1.159307 -1.24881
H  0.348228 1.128992 1.551464
H  -0.568029 1.405103 -1.375342
H  -2.811613 1.002959 -0.497033
H  0.622349 2.532147 0.484803
H  -0.322317 -1.314911 1.428215
totalener: -312.22937089 hartree
nucrepener: 380.60463729 hartree
electener: -692.83400819 hartree
oneelecener: -1162.22625336 hartree
twoeener: 469.39224517 hartree
kineticenergy: 309.97395025 hartree
exchangeener: -36.301698037175 hartree
correlationener: -2.304370799779 hartree
xcener: -38.606068836953 hartree
chargesum: 1.0000000
charge: -0.163844 0.149826 -0.169140 0.152226 -0.095447 -0.110665 -0.175388 0.133888 0.151643 -0.186194 0.130851 0.153837 -0.162613 0.050006 0.162660 0.139034 0.141282 0.202168 0.159420 0.181955 0.154496
charge: 0.094570 0.006446 0.096987 -0.001684 0.099386 0.076909 0.076627 -0.002472 0.005239 0.114891 -0.008599 -0.001415 0.076151 0.333496 -0.015039 -0.001147 0.002457 0.012388 0.008125 0.041067 -0.014380
qa: -0.1638 0.1498 -0.1691 0.1522 -0.0954 -0.1107 -0.1754 0.1339 0.1516 -0.1862 0.1309 0.1538 -0.1626 0.0500 0.1627 0.1390 0.1413 0.2022 0.1594 0.1820 0.1545
va: 3.8110 0.9878 3.8508 0.9813 3.7937 3.8024 3.8648 0.9921 0.9831 3.8285 0.9895 0.9798 3.8544 3.5446 0.9870 0.9912 0.9943 0.9719 0.9826 0.9739 0.9939
energy: -312.229370893662
dipole: 0.48788 -0.87370 -0.38582 1.93932 -1.00936 0.92996 0.14604 -0.26798 -0.12194
magnitude: 1.01418 au
magnitude: 2.57783 debye
