program: Gaussian 09
title: 000051339
version: EM64L-G09RevD.01
frameworkgroup: C1[X(C22H26ClNO4)]
method: RPBEPBE
basis: SDD
operation: Freq
keyword: #p
keyword: freq=noraman
keyword: PBEPBE/SDD
title: #p freq=noraman PBEPBE/SDD
converged: YES YES NO NO
title: Mulliken charges:
elementType: Cl O O O O N C C C C C C C C C C C C C C C C C C C C C C H H H H H H H H H H H H H H H H H H H H H H H H H H
charge: -0.061032 -0.309633 -0.265863 -0.228501 -0.293270 -0.390706 0.217244 -0.390171 -0.723887 0.214568 -0.706314 0.322701 0.522060 -0.717229 -0.365169 -0.346846 -0.452386 -0.376498 -0.300449 0.524829 -0.350386 -0.442817 -0.365543 -0.203545 -0.209490 -0.117075 0.254948 -0.768565 0.233480 0.225323 0.248378 0.231248 0.237325 0.220715 0.217774 0.242521 0.230387 0.231003 0.248677 0.247848 0.235573 0.241798 0.227669 0.235460 0.267667 0.230881 0.239215 0.245477 0.361407 0.255247 0.253872 0.221729 0.249583 0.248768
chargesum: 0.00000
title: Mulliken charges with hydrogens summed into heavy atoms:
elementType: Cl O O O O N C C C C C C C C C C C C C C C C C C C C C C
charge: -0.061032 -0.309633 -0.265863 -0.228501 -0.293270 -0.029299 0.217244 0.068632 -0.006936 0.214568 -0.025304 0.322701 0.522060 -0.255839 -0.116492 -0.098998 -0.216813 -0.134700 0.162681 0.524829 0.148162 -0.203602 -0.120066 0.051702 0.044382 -0.117075 0.254948 -0.048485
polarizability: 3.75559094e+02 -1.19649500e+01 2.40532623e+02 -1.85813194e+01 -7.16531727e-01 1.99714169e+02
1716.lowfreq: -6.5020 -4.4518 -3.1710 -0.0013 -0.0009 -0.0003 3.1663 10.7118 16.4402
frequency: -3.2864 9.3826 16.3518 18.8014 21.6872 33.0622 42.5849 54.5419 64.1556 70.1232 76.2574 87.9978 105.9306 123.5631 130.9267 155.7436 175.5790 177.9804 192.7624 200.7223 215.8040 233.9377 244.0799 252.0570 264.2682 295.7331 301.6514 323.1280 332.0855 338.6279 350.2840 395.3115 409.6903 414.4232 416.6999 426.0983 447.4472 455.8334 479.3409 482.7900 513.8943 558.0254 589.5027 595.6037 615.1349 624.6024 631.3525 649.3677 682.8343 709.1773 714.2764 732.5701 739.4255 748.0579 782.1167 793.9728 814.3305 822.5087 831.8765 832.4548 839.2516 854.5031 864.2258 884.4165 889.9016 929.1228 932.5018 955.0509 967.3302 970.0175 970.6061 994.2073 995.9636 1000.5113 1007.3071 1024.1749 1030.6276 1042.5633 1044.6041 1072.1071 1073.0051 1092.5807 1101.7788 1109.0397 1121.3195 1134.0136 1155.1260 1168.2086 1181.4874 1185.0224 1194.9954 1196.8255 1210.8462 1214.5452 1221.6425 1253.7540 1282.7433 1285.3190 1288.1314 1296.7238 1310.4097 1330.6391 1345.8954 1357.8164 1371.2043 1376.5765 1380.1960 1387.3408 1395.8149 1397.1944 1407.0420 1444.8378 1451.9479 1453.7013 1461.3144 1466.1760 1466.8582 1467.5969 1474.1965 1476.0610 1478.2243 1487.7840 1492.1396 1494.3988 1578.1844 1587.9032 1600.2901 1613.1544 1614.4739 1644.4636 2969.4956 2975.0118 2986.3478 2996.5934 2997.0818 3000.0705 3021.0598 3027.6212 3040.3395 3054.3136 3078.4444 3092.5486 3095.7346 3096.8139 3103.6840 3109.6389 3117.9534 3122.0800 3127.0723 3128.6181 3134.1673 3160.4392 3165.6474 3167.0426 3170.2840 3476.2197
redmass: 5.7287 5.8790 4.8489 4.0085 5.5014 4.7209 4.4153 4.0996 3.8325 1.9294 1.9107 7.0359 4.7141 4.0583 4.2021 3.7935 3.6815 1.6947 5.3321 2.1400 2.7164 1.2424 3.4670 3.1966 2.9283 3.1706 3.7765 3.8358 4.6361 3.3380 2.7600 3.9993 2.9362 3.6749 3.8772 2.8106 4.7212 3.0072 3.4878 3.2670 3.4974 3.9881 3.3525 3.7867 3.9420 6.3359 4.9130 4.7798 3.8525 3.4775 5.0816 3.4858 1.2619 3.3136 2.2863 1.7375 4.0424 1.5489 2.6518 1.3382 1.2532 2.0105 2.5557 2.6910 2.3704 1.5889 3.6345 1.3680 1.4809 1.4531 1.3638 1.5397 1.4468 4.3038 2.7771 2.2366 1.8686 1.9285 2.1125 2.7377 2.7223 4.0843 1.3910 1.3383 3.1164 3.3580 2.4778 1.5958 1.1321 1.2202 3.0453 1.7297 1.2932 1.7111 2.5444 1.3030 1.4451 1.5454 1.4756 1.3192 1.6774 1.4832 1.3369 1.3327 4.3098 6.6065 1.2057 1.2359 1.2168 2.5654 2.9610 1.0939 1.0474 1.0715 1.1609 1.0923 1.0856 1.0645 1.0518 1.0677 2.2311 1.1234 2.0219 2.0098 7.1874 7.2636 6.2149 6.3660 6.1166 9.3407 1.0650 1.0597 1.0365 1.0400 1.0356 1.0569 1.1003 1.0665 1.0899 1.0986 1.0998 1.1001 1.0981 1.1005 1.1010 1.0999 1.1055 1.0895 1.0894 1.0898 1.0895 1.0948 1.0953 1.0951 1.0960 1.0801
irintensity: 0.7331 0.2401 0.1648 0.1799 0.3561 1.3406 1.1747 3.2694 3.0883 0.5237 5.5511 2.1330 3.3508 0.7336 1.2269 1.3695 0.5638 1.9058 4.2868 0.3977 5.3598 2.3135 2.9266 1.7115 2.0934 2.3112 8.0886 5.3776 4.7695 0.6923 2.8929 8.2049 1.3640 2.5096 7.7687 9.4806 3.5958 6.2790 1.4639 20.8844 28.6741 12.2787 9.1775 9.9322 2.5403 0.7211 5.5318 8.1832 3.8900 2.3249 3.7072 22.9244 75.8545 22.1049 22.3061 7.7725 8.0778 77.7703 0.0978 0.1195 0.2880 11.3987 7.0423 53.9457 17.9274 6.4773 6.9372 0.3202 0.9690 0.8676 0.1220 6.0455 21.4423 47.7001 16.3289 23.2137 65.1525 14.1603 36.8009 40.0841 4.0489 510.1049 8.5177 23.5606 9.3520 1.2922 124.7730 16.0518 0.7158 1.5601 13.8041 33.5572 74.6714 38.7040 16.4736 7.2330 2.9507 54.0929 29.4542 1.5092 0.6194 7.0006 1.9954 1.5344 0.8383 0.6738 12.5613 64.3052 20.3026 6.6225 3.6013 9.9294 15.3722 2.4188 25.4714 39.1800 62.0338 23.5336 8.5122 7.9704 100.8301 27.2757 292.5153 233.6459 2.9305 3.0225 3.9774 31.9552 176.0907 129.5784 42.1403 29.3341 26.5163 2.9319 9.2095 27.9252 10.8459 15.3210 22.4332 4.0756 52.0400 28.7298 11.0750 20.3935 21.6744 25.7745 13.8160 13.7054 16.0018 11.3531 9.0157 11.7355 5.4336 7.4299 0.8938 241.0742
temp: 298.150 k
press: 1.00000 atm
elementType: 17 8 8 8 8 7 6 6 6 6 6 6 6 6 6 6 6 6 6 6 6 6 6 6 6 6 6 6 1 1 1 1 1 1 1 1 1 1 1 1 1 1 1 1 1 1 1 1 1 1 1 1 1 1
symmnumber: 1
zpe: 1136947.6 jmol-1
zpe.correction: 0.433040 hartree
zpe.thermalcorrener: 0.461377 hartree
zpe.thermalcorrenthalpy: 0.462321 hartree
zpe.thermalcorrgfe: 0.368930 hartree
zpe.sumelectzpe: -1667.583067 hartree
zpe.sumelectthermal: -1667.554731 hartree
zpe.sumelectthermalent: -1667.553787 hartree
zpe.sumelectthermalfe: -1667.647178 hartree
dipole: 3.4917 0.4734 2.0187
dipole: 4.0609
quadrupole: -241.6514 -167.4714 -163.4489
quadrupole: 10.4294 -14.5076 -3.5756
quadrupole: -50.7942 23.3859 27.4084 10.4294 -14.5076 -3.5756
hfenergy: -1668.0161078 hartree
pointgroup: C01 [X(C22H26Cl1N1O4)]
dipole: -1.3529952 -0.5652581 0.634456 debye
polarizability: 375.6411497|-20.7383326|228.7938664|2.2818212|19.5330638|211.3708699 unknown
InChI: InChI=1S/C22H26ClNO4/c1-4-22(3,21(26)27-14-13-24-16(2)25)28-20-11-7-18(8-12-20)15-17-5-9-19(23)10-6-17/h5-12,24H,4,13-15H2,1-3H3
charge 0 multiplicity 1
54 atoms
Cl -8.470729 2.231655 1.169096
O  1.232635 -0.626722 -0.499255
O  3.947308 0.831232 1.418865
O  3.896453 -0.791308 -0.251177
O  8.744202 0.872283 -0.886512
N  6.512389 0.250277 -0.655051
C  1.773727 0.241748 0.588911
C  1.44824 1.740475 0.323318
C  1.259324 -0.207679 1.976295
C  3.298413 0.00492 0.502736
C  1.969264 2.267859 -1.02842
C  -0.163861 -0.876623 -0.537395
C  -2.924661 -1.532163 -0.790457
C  -4.397987 -1.898322 -0.961937
C  -0.643139 -2.120782 -0.068138
C  -1.057884 0.037299 -1.148532
C  -2.012898 -2.440367 -0.197391
C  -2.424274 -0.291837 -1.264633
C  5.436682 0.693507 1.570655
C  -5.387477 -0.853796 -0.446912
C  6.238281 1.248558 0.382602
C  -6.487736 -0.443804 -1.239889
C  -5.246825 -0.295835 0.850489
C  -7.432045 0.493637 -0.75999
C  -6.17816 0.639546 1.350504
C  -7.260871 1.019904 0.533123
C  7.769921 0.126313 -1.221638
C  7.905447 -0.967067 -2.277361
H  1.877012 2.331035 1.153358
H  0.348604 1.851107 0.383768
H  1.74755 0.38553 2.766697
H  1.474543 -1.276214 2.150162
H  0.167861 -0.056754 2.041337
H  3.074223 2.302836 -1.049838
H  1.601393 3.292817 -1.213435
H  1.640768 1.621436 -1.860881
H  -4.607643 -2.083271 -2.034187
H  -4.584851 -2.860827 -0.445281
H  0.065749 -2.829087 0.372372
H  -0.6781 0.979042 -1.556269
H  -2.37476 -3.410896 0.163884
H  -3.11232 0.421212 -1.734228
H  5.625062 1.286081 2.479012
H  5.679869 -0.369374 1.749587
H  7.225292 1.606011 0.733179
H  5.706416 2.13202 -0.027513
H  -6.615571 -0.857798 -2.247342
H  -4.396065 -0.590475 1.475632
H  5.743233 -0.380459 -0.907092
H  -8.27774 0.806261 -1.379431
H  -6.065726 1.063535 2.352725
H  6.986259 -1.56272 -2.410107
H  8.173571 -0.504107 -3.24315
H  8.735235 -1.637945 -1.996464
