program: Orca
programVersion: 5.0.3
elementType: C H C H C C C H H C H H C C H H H H H H H
charge: 1
multiplicity: 1
keywords: DSD-PBEP86 cc-pVTZ EnGrad D3BJ RIJCOSX verytightscf cc-pVTZ/C def2/J soscf
formula: C8H13
InChI: InChI=1/C8H13/c1-2-4-6-8-7-5-3-1/h1-2,7H,3-6,8H2
21 atoms
C  -1.990158 0.561911 0.10408
H  -2.166255 0.744532 1.168996
C  -1.871696 -0.972793 -0.174767
H  -2.662988 -1.528395 0.335146
C  -0.466775 -1.259927 0.326631
C  0.635016 -1.205495 -0.464569
C  1.926138 -0.682851 0.072405
H  2.066877 -0.94691 1.125825
H  2.794631 -1.038061 -0.491389
C  1.843477 0.871502 -0.079618
H  1.905184 1.138169 -1.141403
H  2.690495 1.350657 0.419554
C  0.514009 1.45584 0.510311
C  -0.636803 1.064214 -0.307721
H  0.530473 -1.298654 -1.546192
H  -1.945343 -1.169653 -1.249171
H  0.376769 1.209238 1.566677
H  -0.51545 1.241889 -1.380657
H  -2.789643 1.026227 -0.484554
H  0.610295 2.556018 0.428523
H  -0.331896 -1.250905 1.409768
totalener: -311.13212182 hartree
nucrepener: 381.60477607 hartree
electener: -692.73689790 hartree
oneelecener: -1163.55524747 hartree
twoeener: 470.81834957 hartree
kineticenergy: 309.72397845 hartree
exchangeener: -13.665520304300 hartree
correlationener: -0.922819635066 hartree
xcener: -14.588339939367 hartree
chargesum: 1.0000000
charge: -0.226500 0.175824 -0.226607 0.181995 -0.111434 -0.135722 -0.241535 0.163753 0.180460 -0.245476 0.156785 0.182034 -0.232505 0.022446 0.208137 0.165686 0.171944 0.225919 0.185599 0.208506 0.190691
charge: 0.088427 0.004557 0.091427 -0.000366 0.109208 0.092295 0.072708 -0.001058 0.005646 0.105509 -0.007184 -0.000474 0.068643 0.326721 -0.010478 0.000117 0.002942 0.012307 0.008186 0.038121 -0.007254
qa: -0.2265 0.1758 -0.2266 0.1820 -0.1114 -0.1357 -0.2415 0.1638 0.1805 -0.2455 0.1568 0.1820 -0.2325 0.0224 0.2081 0.1657 0.1719 0.2259 0.1856 0.2085 0.1907
va: 3.8599 0.9815 3.8955 0.9751 3.8292 3.8371 3.9129 0.9851 0.9768 3.8847 0.9829 0.9722 3.9085 3.6060 0.9691 0.9862 0.9837 0.9598 0.9757 0.9655 0.9797
dispcorr: -0.011956983 hartree
energy: -311.835140459508
dipole: 0.52770 -0.88478 -0.35708 1.90422 -1.16644 0.73777 0.15079 -0.28353 -0.13273
magnitude: 0.83032 au
magnitude: 2.11051 debye
