program: Orca
programVersion: 5.0.3
elementType: C H C H C C C H H C H H C C H H H H H H H
charge: 1
multiplicity: 1
keywords: PBE0 cc-pVTZ EnGrad D3BJ RIJCOSX verytightscf cc-pVTZ/C def2/J soscf
formula: C8H13
InChI: InChI=1/C8H13/c1-2-4-6-8-7-5-3-1/h1-2,7H,3-6,8H2
21 atoms
C  -1.990333 0.560033 0.105409
H  -2.166334 0.743144 1.170146
C  -1.875464 -0.97388 -0.174825
H  -2.663864 -1.531547 0.337143
C  -0.469031 -1.255405 0.324406
C  0.633814 -1.202255 -0.466689
C  1.924825 -0.681544 0.0723
H  2.06341 -0.947232 1.12561
H  2.793175 -1.0383 -0.490606
C  1.845351 0.873335 -0.0776
H  1.909182 1.1409 -1.139059
H  2.693128 1.349646 0.422972
C  0.516384 1.45829 0.509859
C  -0.632681 1.054189 -0.306207
H  0.530865 -1.300428 -1.547927
H  -1.950722 -1.170772 -1.249092
H  0.379964 1.218351 1.567944
H  -0.509309 1.221546 -1.38049
H  -2.786879 1.02946 -0.48322
H  0.607816 2.558179 0.421456
H  -0.333193 -1.243097 1.407416
totalener: -312.06242543 hartree
nucrepener: 381.74697933 hartree
electener: -693.80940476 hartree
oneelecener: -1164.45503202 hartree
twoeener: 470.64562725 hartree
kineticenergy: 309.63599102 hartree
exchangeener: -34.155126707809 hartree
correlationener: -1.965205230848 hartree
xcener: -36.120331938657 hartree
chargesum: 1.0000000
charge: -0.160721 0.151199 -0.166101 0.153194 -0.092472 -0.117481 -0.175419 0.140739 0.154539 -0.198051 0.138064 0.153879 -0.168688 0.009302 0.181522 0.143809 0.148667 0.198929 0.159155 0.181899 0.164037
charge: 0.087615 0.005038 0.090636 0.000166 0.110298 0.093982 0.073108 0.000604 0.007390 0.105047 -0.005358 0.000673 0.068284 0.312785 -0.009327 0.001504 0.003992 0.011037 0.008997 0.039470 -0.005941
qa: -0.1607 0.1512 -0.1661 0.1532 -0.0925 -0.1175 -0.1754 0.1407 0.1545 -0.1981 0.1381 0.1539 -0.1687 0.0093 0.1815 0.1438 0.1487 0.1989 0.1592 0.1819 0.1640
va: 3.8405 0.9918 3.8760 0.9872 3.8197 3.8272 3.8902 0.9938 0.9879 3.8684 0.9901 0.9852 3.8822 3.6289 0.9829 0.9948 0.9928 0.9753 0.9866 0.9784 0.9931
dispcorr: -0.018917089 hartree
energy: -312.081342519185
dipole: 0.53154 -0.84797 -0.31643 1.90018 -1.19962 0.70056 0.15189 -0.27538 -0.12349
magnitude: 0.77856 au
magnitude: 1.97895 debye
