program: Gaussian 09
title: 000006922
version: EM64L-G09RevD.01
frameworkgroup: C1[X(C7H6F3N)]
method: RPBEPBE
basis: SDD
operation: Freq
keyword: #pfreq=noraman
keyword: PBEPBE/SDD
title: #p freq=noraman PBEPBE/SDD
converged: NO NO NO NO
title: Mulliken charges:
elementType: F F F N C C C C C C C H H H H H H
charge: -0.161183 -0.182732 -0.182565 -0.683759 0.152184 0.376656 -0.338653 0.249311 -0.382051 -0.259426 -0.194229 0.259571 0.222019 0.236224 0.229042 0.345628 0.313963
chargesum: 0.00000
title: Mulliken charges with hydrogens summed into heavy atoms:
elementType: F F F N C C C C C C C
charge: -0.161183 -0.182732 -0.182565 -0.024169 0.152184 0.376656 -0.079083 0.249311 -0.160032 -0.023202 0.034813
polarizability: 1.02510257e+02 6.55215470e+00 1.01190850e+02 -4.35160952e-03 6.90050830e-03 4.12580895e+01
1716.lowfreq: -13.7380 -5.5849 -0.0006 -0.0005 0.0002 1.1458 17.5900 110.1177 187.6925
frequency: -12.9850 110.1159 187.6808 194.9328 307.9432 322.0287 328.1151 385.7631 424.6998 427.9060 431.7249 506.4056 514.7689 549.6475 568.0933 606.1202 686.6385 730.8063 757.4081 833.3644 851.5281 938.0558 959.9446 972.5046 980.4238 1005.8580 1026.5987 1057.3880 1155.2695 1178.9692 1266.5997 1294.4679 1333.4049 1398.7400 1461.4192 1499.9241 1582.7407 1630.8522 1661.4638 3122.5466 3144.4268 3157.2923 3177.7925 3558.2115 3695.3064
redmass: 7.2241 5.0031 7.3068 4.5814 7.6709 4.5211 8.9906 1.1481 4.4308 4.5287 1.2809 4.1813 6.9620 7.2894 4.5799 10.1159 7.6943 3.6584 1.3225 5.5745 1.4622 3.0563 1.9489 8.2837 1.3279 6.8630 1.8461 1.8853 1.3835 1.0572 4.5790 1.7818 1.8291 7.7494 2.8894 3.0239 6.6123 5.1522 1.2162 1.0871 1.0917 1.0917 1.0997 1.0457 1.1041
irintensity: 2.2816 0.0052 3.3249 6.1874 4.7529 1.1767 4.4409 0.1513 1.4819 0.7102 244.0482 0.3624 0.0585 4.8095 1.1293 14.6473 7.3292 9.1263 124.7137 5.0760 0.0020 207.8742 69.2442 174.3305 2.9226 110.8914 29.7145 6.1288 1.6520 13.0553 258.9173 43.8589 31.8068 5.8654 38.5062 97.3229 47.1339 90.6777 205.0588 9.1589 15.6032 7.4104 11.8771 88.6640 35.4955
temp: 298.150 k
press: 1.00000 atm
elementType: 9 9 9 7 6 6 6 6 6 6 6 1 1 1 1 1 1
symmnumber: 1
zpe: 310944.7 jmol-1
zpe.correction: 0.118433 hartree
zpe.thermalcorrener: 0.127263 hartree
zpe.thermalcorrenthalpy: 0.128207 hartree
zpe.thermalcorrgfe: 0.084820 hartree
zpe.sumelectzpe: -623.835765 hartree
zpe.sumelectthermal: -623.826935 hartree
zpe.sumelectthermalent: -623.825991 hartree
zpe.sumelectthermalfe: -623.869377 hartree
dipole: -3.1412 2.0980 -0.0016
dipole: 3.7773
quadrupole: -61.3662 -49.6652 -68.3847
quadrupole: 0.4648 -0.0059 -0.0013
quadrupole: -1.5609 10.1401 -8.5793 0.4648 -0.0059 -0.0013
hfenergy: -623.9541978 hartree
pointgroup: C01 [X(C7H6F3N1)]
dipole: -1.2295596 -0.8347079 0.002688 debye
dipolederiv: -0.5408354 -0.2577143 0.0001569 -0.2181069 -0.6900255 -0.0002332 0.0004709 0.0000487 -0.2751557 -0.7004622 0.0562469 -0.2095508 0.1889386 -0.3441351 0.2068833 -0.2511819 0.1367288 -0.6407622 -0.6998884 0.0555064 0.2100874 0.1883314 -0.34333 -0.2069475 0.2523196 -0.1363489 -0.6422682 -0.3964761 0.5902498 -0.0003485 0.4831288 -1.1680866 0.0000406 -0.0001328 -0.0005669 -0.6812808 -0.6347958 -0.2379163 0.0005276 0.2915582 -0.3709211 -0.0001439 -0.000216 0.0001248 -0.2546115 0.3774972 -0.7249153 0.0003395 -0.4598199 1.1715494 -0.0005288 0.0001984 -0.0002831 0.179945 0.3650384 0.1180259 -0.0005069 -0.3230946 0.0511483 0.0001927 0.0000998 -0.0001388 -0.0836756 2.2342369 0.2506943 -0.0011062 -0.075354 1.255066 0.0003194 -0.0020619 -0.0004592 1.5461414 -0.1928415 0.5572063 -0.0004705 0.0504549 -0.167501 -0.0000833 -0.0000853 -0.0003132 -0.2255206 -0.3671078 -0.2295365 0.0003306 -0.1420415 -0.1640036 0.0001002 0.0002859 0.0001785 -0.2232896 0.1843205 -0.0345451 -0.000196 0.1379807 0.379129 -0.0004875 -0.0002946 -0.0003647 -0.1008025 0.0819259 -0.0699235 0.0001226 -0.0543227 0.0045072 0.0001803 0.0000722 0.0001507 0.1552517 0.037446 -0.0516422 0.0001588 -0.0895857 -0.098389 0.0002889 0.0001575 0.0002927 0.1696009 0.0305244 0.0762837 0.0000817 0.0846065 -0.0575889 0.0001037 0.0000393 0.0001124 0.1804156 -0.1207021 -0.0010114 0.0002193 -0.0058701 0.099488 0.000039 0.0002012 0.000018 0.150928 0.2141503 -0.0739187 0.000044 -0.0195828 0.2104443 0.0001152 -0.0000057 0.0005944 0.3672587 0.1279698 -0.0230898 0.0001105 -0.0372207 0.2326485 0.0001609 0.0001334 0.0002259 0.3778253 unknown
polarizability: 102.609115|-6.5414823|101.0919063|-0.053816|-0.0422434|41.2581744 unknown
InChI: InChI=1S/C7H6F3N/c8-7(9,10)5-3-1-2-4-6(5)11/h1-4H,11H2
charge 0 multiplicity 1
17 atoms
F  2.119092 1.551307 -0.001896
F  2.155834 -0.422213 1.125978
F  2.153775 -0.420283 -1.13228
N  0.046779 -2.247888 0.001945
C  0.08264 0.226989 -0.000101
C  -0.613312 -1.029906 0.001501
C  -0.634062 1.447801 -0.000601
C  1.572559 0.250438 -0.002059
C  -2.041481 -0.994532 0.002561
C  -2.040392 1.460817 0.000776
C  -2.736817 0.225434 0.002246
H  -0.072788 2.387322 -0.001886
H  -2.592924 -1.942645 0.003706
H  -2.583457 2.410107 0.000553
H  -3.832799 0.215561 0.003097
H  1.061281 -2.313661 0.002225
H  -0.487229 -3.112447 0.002934
