program: Gaussian 09
title: 000051108
version: EM64L-G09RevD.01
frameworkgroup: C1[X(C11H8S2)]
method: RPBEPBE
basis: SDD
operation: Freq
keyword: #pfreq=noraman
keyword: PBEPBE/SDD
title: #p freq=noraman PBEPBE/SDD
converged: YES YES NO NO
title: Mulliken charges:
elementType: S S C C C C C C C C C C C H H H H H H H H
charge: 0.035328 0.096264 0.381136 0.389111 -0.519335 0.747237 -0.417348 -0.410031 -0.406034 -0.407424 -0.241010 -0.231162 -0.888855 0.248517 0.241108 0.244812 0.244792 0.269740 0.234072 0.233080 0.156004
chargesum: 0.00000
title: Mulliken charges with hydrogens summed into heavy atoms:
elementType: S S C C C C C C C C C C C
charge: 0.191332 0.096264 0.381136 0.389111 -0.270818 0.747237 -0.176241 -0.165220 -0.161242 -0.137684 -0.006938 0.001918 -0.888855
polarizability: 2.88172172e+02 -1.66578437e+01 1.67970529e+02 6.09808975e-01 4.01874340e-02 5.47456052e+01
1716.lowfreq: -5.8549 -0.0014 0.0003 0.0005 6.2574 10.3181 17.7976 78.0948 136.6110
frequency: 16.3335 78.0897 136.6100 181.9604 231.0798 248.4854 285.5646 351.6187 377.6578 393.5773 421.1243 457.6234 476.3058 512.7606 569.0019 570.4353 623.9689 672.0591 758.6786 762.5551 763.7599 785.8295 841.7271 855.8056 883.7385 885.2857 919.9034 941.0701 969.6775 994.6948 1001.8092 1022.2609 1054.7857 1129.9928 1161.6735 1175.1482 1218.3616 1241.0786 1278.7979 1286.6754 1351.6217 1411.0575 1424.1995 1440.0076 1459.1964 1506.0574 1573.7121 1599.0846 1632.2283 2447.4535 3124.7391 3129.4356 3129.9967 3132.0066 3146.8147 3161.1150 3165.4960
redmass: 8.1327 5.6261 8.2086 3.6690 5.0476 11.5158 8.5251 1.1597 9.5742 2.5240 4.7084 4.4458 2.5086 6.8835 6.1330 5.3808 6.8191 2.7294 3.4739 4.5790 1.3696 2.5406 1.2934 2.0477 1.7769 2.5632 1.7814 4.8583 1.4086 1.3424 1.3677 2.3783 3.1347 1.7026 1.2307 1.0817 1.7459 2.0064 2.6728 1.7505 1.7876 4.4760 3.1967 4.5635 2.4109 3.5596 6.4363 5.7525 6.6116 1.0377 1.0862 1.0899 1.0901 1.0889 1.0951 1.0959 1.1004
irintensity: 0.0617 0.1879 0.5729 0.6246 0.0163 2.0026 0.7706 40.5923 1.0501 3.7389 14.4673 7.2979 11.6071 0.5807 13.0794 7.8309 3.5986 0.6482 69.5261 8.5358 50.2828 1.3036 27.5869 22.0684 54.3219 48.0085 13.9183 18.8223 10.9405 0.0159 0.0456 3.4702 55.1554 13.1004 4.4581 0.3587 116.8542 17.4134 96.6326 4.6874 19.3613 4.5699 8.9815 0.4353 31.3074 5.5028 3.2476 15.1096 37.5476 2.5439 1.5198 0.1894 10.8413 2.1593 26.7989 9.1455 37.7279
temp: 298.150 k
press: 1.00000 atm
elementType: 16 16 6 6 6 6 6 6 6 6 6 6 6 1 1 1 1 1 1 1 1
symmnumber: 1
zpe: 396991.5 jmol-1
zpe.correction: 0.151206 hartree
zpe.thermalcorrener: 0.162096 hartree
zpe.thermalcorrenthalpy: 0.163040 hartree
zpe.thermalcorrgfe: 0.112738 hartree
zpe.sumelectzpe: -1219.207064 hartree
zpe.sumelectthermal: -1219.196175 hartree
zpe.sumelectthermalent: -1219.195231 hartree
zpe.sumelectthermalfe: -1219.245532 hartree
dipole: -3.0979 0.9144 -0.0280
dipole: 3.2301
quadrupole: -81.5885 -82.0183 -96.1882
quadrupole: 5.5625 -0.1268 0.5797
quadrupole: 5.0098 4.5800 -9.5898 5.5625 -0.1268 0.5797
hfenergy: -1219.3582704 hartree
pointgroup: C01 [X(C11H8S2)]
dipole: 1.2202702 -0.3544915 0.0168228 debye
dipolederiv: -0.0971901 -0.1906124 0.0182989 -0.4620358 -0.7611365 0.099759 0.049071 0.1018231 -0.0969481 -0.7347308 0.3105141 -0.0186272 0.2278017 -0.5927209 0.0526991 -0.0211221 0.0550404 -0.1128577 -0.2289415 -0.1118753 0.0307783 -0.1595092 -0.0929143 0.03129 0.0375448 0.0297603 0.034534 0.2882337 -0.1315191 0.0201227 0.009886 -0.0714208 0.0228499 -0.0103829 0.0261567 0.0429861 0.450181 0.0630921 -0.0297996 -0.1758797 0.0103648 -0.029789 -0.0011087 -0.0361055 -0.136259 -1.0449799 -0.0102345 0.0318096 0.026931 -0.1101852 0.0316547 0.0205495 0.0384465 0.1258582 -0.2690879 0.1167454 -0.0210302 0.0621614 0.1467231 -0.0608902 -0.0086228 -0.0613916 -0.1413307 0.0418774 0.1016606 -0.0261027 -0.111925 0.0886986 -0.0464534 0.0197744 -0.0507616 -0.1516074 -0.2483189 0.118641 -0.022211 0.2061653 0.0768867 -0.0536633 -0.0390638 -0.0517514 -0.1585143 0.0351428 -0.1211586 0.0225405 0.2642714 0.0140249 -0.0382897 -0.03615 -0.0224809 -0.133136 -0.0677151 -0.155353 0.0284985 -0.1598228 0.0298853 -0.032665 0.0280114 -0.0329471 -0.1542265 0.1097353 0.0736474 -0.0213687 -0.0022654 0.0389633 -0.0364308 -0.0065644 -0.0377898 -0.1351232 1.637269 -0.037901 -0.0532701 0.2835759 1.2353247 -0.1881651 -0.090532 -0.2000518 -0.2168888 0.078768 -0.0389708 0.0074787 -0.0851345 -0.0266864 0.0390862 0.0261473 0.0345356 0.1454022 0.0329749 -0.0835375 0.019758 -0.0415638 -0.06909 0.0447712 0.0095809 0.0462679 0.1418882 0.0674491 -0.0875869 0.0195417 -0.0117567 -0.0593508 0.0433353 0.0044896 0.0444699 0.1476468 0.0540049 -0.0118545 0.0054765 -0.0936597 -0.0765388 0.0489842 0.0217649 0.0462842 0.1483721 0.0846074 0.1179325 -0.0222529 0.0242901 0.0635062 0.0184367 -0.0063215 0.0098791 0.1498841 -0.029752 0.1031575 -0.0151724 0.1201049 -0.0182327 0.0326249 -0.018527 0.0327804 0.1574635 -0.1307217 -0.0401522 0.0158672 -0.0411675 0.0881133 0.01527 0.0164468 0.015204 0.1563064 -0.0288055 0.0153651 0.0096644 0.1195323 0.0857856 0.0055852 0.0050147 0.0126319 0.1865499 unknown
polarizability: 288.1831692|-16.8057576|164.7480921|-3.8958576|-18.2260891|57.9570448 unknown
InChI: InChI=1S/C11H8S2/c12-11(13)10-6-5-8-3-1-2-4-9(8)7-10/h1-7,12H
charge 0 multiplicity 1
21 atoms
S  -3.430352 -1.818493 0.398903
S  -4.199272 1.137073 0.04441
C  0.826546 -0.525598 0.148538
C  1.268482 0.826115 -0.129905
C  -0.572527 -0.797654 0.238672
C  -1.536278 0.216766 0.064395
C  0.275252 1.848946 -0.303518
C  1.808486 -1.558046 0.326322
C  2.671358 1.094353 -0.221241
C  -1.0803 1.55992 -0.209836
C  3.170902 -1.267591 0.231648
C  3.605359 0.068693 -0.044323
C  -2.99053 -0.048518 0.154586
H  -0.881148 -1.827152 0.456209
H  0.60308 2.873581 -0.514455
H  1.472652 -2.580316 0.537243
H  3.004619 2.117244 -0.431967
H  -1.836195 2.340032 -0.342082
H  3.914465 -2.059983 0.367922
H  4.677266 0.283117 -0.115838
H  -4.792664 -1.582287 0.440416
