program: Orca
programVersion: 5.0.3
elementType: C H C H C C C H H C H H C C H H H H H H H
charge: 1
multiplicity: 1
keywords: PBE0 cc-pVTZ EnGrad D3BJ RIJCOSX verytightscf cc-pVTZ/C def2/J soscf
formula: C8H13
InChI: InChI=1/C8H13/c1-2-4-6-8-7-5-3-1/h1-2,7H,3-6,8H2
21 atoms
C  -1.990543 0.558229 0.106697
H  -2.166454 0.741809 1.171262
C  -1.879219 -0.974948 -0.174862
H  -2.664704 -1.534652 0.33919
C  -0.471282 -1.250808 0.322189
C  0.632636 -1.198972 -0.468778
C  1.923572 -0.680235 0.072179
H  2.060033 -0.947555 1.125366
H  2.791743 -1.038542 -0.489889
C  1.847255 0.87517 -0.07558
H  1.913282 1.143654 -1.136695
H  2.695725 1.348638 0.42648
C  0.518708 1.460609 0.509344
C  -0.628586 1.044067 -0.304641
H  0.531239 -1.302022 -1.54962
H  -1.95612 -1.171886 -1.248984
H  0.383102 1.227247 1.569082
H  -0.50331 1.201415 -1.380132
H  -2.784092 1.032735 -0.481952
H  0.605158 2.560161 0.414391
H  -0.334515 -1.235323 1.405064
totalener: -312.06334472 hartree
nucrepener: 381.89273179 hartree
electener: -693.95607651 hartree
oneelecener: -1164.74224796 hartree
twoeener: 470.78617145 hartree
kineticenergy: 309.63638403 hartree
exchangeener: -34.155578017063 hartree
correlationener: -1.965517338789 hartree
xcener: -36.121095355852 hartree
chargesum: 1.0000000
charge: -0.160748 0.150797 -0.165880 0.153283 -0.090279 -0.115803 -0.175777 0.140713 0.154610 -0.198232 0.138038 0.153852 -0.168345 0.005972 0.182559 0.143722 0.148476 0.198230 0.158927 0.181503 0.164380
charge: 0.087537 0.004708 0.090652 0.000148 0.111653 0.096602 0.073320 0.000675 0.007385 0.104457 -0.005288 0.000671 0.067968 0.309973 -0.008937 0.001505 0.003874 0.010604 0.008796 0.038971 -0.005274
qa: -0.1607 0.1508 -0.1659 0.1533 -0.0903 -0.1158 -0.1758 0.1407 0.1546 -0.1982 0.1380 0.1539 -0.1683 0.0060 0.1826 0.1437 0.1485 0.1982 0.1589 0.1815 0.1644
va: 3.8413 0.9920 3.8754 0.9873 3.8189 3.8261 3.8908 0.9938 0.9879 3.8688 0.9900 0.9852 3.8818 3.6339 0.9825 0.9950 0.9927 0.9757 0.9866 0.9785 0.9930
dispcorr: -0.018917554 hartree
energy: -312.082262273972
dipole: 0.53515 -0.84427 -0.30912 1.89627 -1.22341 0.67286 0.15308 -0.27688 -0.12380
magnitude: 0.75075 au
magnitude: 1.90825 debye
