program: Gaussian 09
title: 000051142
version: EM64L-G09RevD.01
frameworkgroup: C1[X(C20H36NS)]
method: RPBEPBE
basis: SDD
operation: Freq
keyword: #p
keyword: freq=noraman
keyword: PBEPBE/SDD
title: #p freq=noraman PBEPBE/SDD
converged: YES YES NO NO
title: Mulliken charges:
elementType: S N C C C C C C C C C C C C C C C C C C C C H H H H H H H H H H H H H H H H H H H H H H H H H H H H H H H H H H H H
charge: 0.239701 -0.022082 -0.385927 -0.385666 -0.385672 -0.381971 -0.383678 -0.373338 -0.370341 -0.353191 -0.296862 -0.356419 -0.722454 -0.693851 -0.647320 -0.266243 -0.304854 0.423648 0.425340 -0.353983 -0.773186 -0.772202 0.197247 0.195374 0.195853 0.195055 0.199193 0.197049 0.192976 0.193671 0.202791 0.195957 0.190940 0.190426 0.205653 0.197428 0.188026 0.188622 0.202056 0.236118 0.195565 0.194959 0.252637 0.290619 0.210152 0.218990 0.209577 0.304711 0.279264 0.303665 0.288715 0.282815 0.265059 0.242845 0.263770 0.263954 0.242765 0.266056
chargesum: 1.00000
title: Mulliken charges with hydrogens summed into heavy atoms:
elementType: S N C C C C C C C C C C C C C C C C C C C C
charge: 0.239701 -0.022082 0.006695 0.005242 0.010570 0.004677 0.015070 0.008027 0.032739 0.023457 0.141311 0.034105 -0.179198 -0.055132 -0.063345 0.037422 -0.016139 0.423648 0.425340 -0.071168 -0.001512 0.000573
polarizability: 3.51667508e+02 1.34666057e+01 2.23898032e+02 -1.57606371e+01 7.96866888e+00 1.79264938e+02
1716.lowfreq: -12.1492 -0.0024 -0.0015 -0.0013 0.8167 6.1942 8.6221 13.3027 14.3522
frequency: -3.6157 11.6604 12.5296 21.5191 26.7266 33.0359 53.5159 59.4164 67.4676 67.9963 71.1875 86.5670 90.3230 96.7404 122.9143 127.5441 141.1370 147.8915 151.4593 157.7738 186.7578 202.8953 224.4794 229.2905 229.6913 236.3806 267.6576 296.5205 308.7389 314.5121 401.2864 411.9288 455.4376 483.5426 489.6004 498.0109 510.5767 518.6867 531.3384 602.0935 656.4974 677.3564 709.6712 721.2630 723.3426 727.9001 734.3909 750.4104 779.6679 823.8221 866.9250 873.7640 879.3410 887.8007 895.3176 922.3326 932.6697 957.0339 969.1993 978.0958 983.7887 986.1665 1010.9701 1012.8565 1022.2992 1026.2940 1028.2571 1031.3423 1048.1565 1049.5020 1059.4490 1065.7271 1073.2294 1078.1786 1081.2666 1084.8037 1088.5604 1122.3421 1158.9346 1172.3307 1180.8529 1199.1466 1200.3770 1201.5580 1224.1957 1227.2163 1247.8337 1251.6910 1268.0238 1272.7218 1276.2865 1278.9616 1283.6128 1288.4905 1291.4677 1296.6809 1298.3803 1298.9237 1315.1572 1318.7957 1322.5912 1335.7117 1346.8083 1351.9515 1355.2221 1355.8952 1374.9175 1389.6853 1407.4264 1410.2081 1420.3686 1434.6505 1453.7898 1459.7780 1459.8894 1462.7712 1463.4347 1464.0925 1465.1040 1465.3318 1467.7910 1468.4209 1473.2267 1477.7346 1478.1902 1482.7762 1485.9142 1486.6082 1488.4017 1493.9990 1592.9840 1614.4028 2949.2714 2949.5472 2951.4860 2953.0260 2955.6886 2958.6637 2962.2959 2966.3630 2968.2588 2972.9459 2973.4091 2983.2278 2987.0978 2992.3195 2997.2508 2997.6029 2998.6809 3006.6242 3008.4742 3016.2433 3026.1404 3035.1850 3042.3786 3049.4411 3050.2950 3068.9729 3073.0492 3080.2272 3080.6004 3088.6347 3109.4982 3109.7297 3131.5862 3147.8847 3187.9429 3193.2326
redmass: 2.3341 3.9661 2.7096 3.6050 4.0730 3.2771 2.5037 2.0485 1.3911 1.2137 1.5774 3.2027 2.6538 2.0564 2.0753 2.2055 3.5725 1.9175 2.8908 2.7314 2.9029 3.0431 3.3504 1.1219 2.8138 3.7160 2.7718 2.5448 4.7612 3.2368 3.3779 3.4252 2.5385 3.0289 3.1210 4.2882 2.8471 5.1401 4.8249 4.8788 5.2402 2.8121 3.2164 1.0594 1.0687 1.0768 1.1278 1.1618 1.1944 1.2325 1.4652 1.3031 1.3836 1.9039 1.4871 3.8482 1.2763 1.3324 2.9132 4.7302 1.3855 3.4075 1.6794 3.7233 5.4553 1.4889 2.0280 1.4950 3.2837 1.5377 1.6015 2.7545 2.8024 2.3459 2.1127 2.0380 1.3165 2.8525 1.8812 1.4462 1.8957 1.3829 1.2413 1.4071 1.3353 1.3517 1.2822 1.3030 1.2406 1.2345 1.2478 1.0291 1.0976 1.1197 1.0857 1.2092 1.1190 1.1842 2.8698 1.3828 1.2627 1.4163 1.4989 1.6603 1.6086 1.6315 4.1918 1.2160 1.2657 1.2567 1.9797 1.1005 1.3030 1.0744 1.0740 1.0699 1.0712 1.0435 1.0437 1.0680 1.1459 1.0872 1.0852 1.0429 1.0862 1.0911 1.2210 1.1024 1.0963 1.7540 5.4296 4.6291 1.0586 1.0587 1.0591 1.0591 1.0592 1.0592 1.0592 1.0596 1.0590 1.0363 1.0628 1.0964 1.0974 1.0987 1.0382 1.0382 1.1002 1.0957 1.0669 1.1025 1.1037 1.1037 1.1037 1.0798 1.0794 1.1007 1.0992 1.0978 1.0979 1.1058 1.0998 1.0998 1.1106 1.0937 1.0939 1.0964
irintensity: 0.2684 0.0660 0.2892 0.6945 0.0518 0.9181 0.4061 0.5401 0.5551 0.4082 0.7383 1.8537 0.2300 0.7543 0.0053 0.3772 1.1183 0.2444 0.0836 0.1997 2.4235 0.8103 0.3095 0.0044 0.6177 0.2363 0.1833 1.3232 1.0512 0.0551 1.2553 0.4734 0.3857 0.3446 0.9800 2.7687 0.5580 1.0249 1.2404 7.9969 32.3501 17.8426 21.8800 16.6121 1.2969 9.4304 0.1919 1.0008 0.4709 0.6758 13.9161 4.7774 0.3652 4.1879 2.4942 17.6304 1.4270 0.5609 1.9678 0.0099 1.1567 3.8211 0.3893 3.4239 1.4284 0.5745 0.6494 0.2977 2.9280 0.0506 23.2484 0.1872 2.2818 0.2854 0.1421 1.1757 0.3913 20.9879 69.5891 2.0542 0.1484 4.1642 8.6204 7.4857 3.2036 0.7253 7.3125 0.6819 11.5410 2.3717 0.4407 0.7986 0.1334 0.0982 0.3397 3.9903 0.1186 2.5317 11.4776 10.7440 0.3927 5.1494 0.1833 0.0907 0.0913 0.9626 10.8778 11.3678 14.6426 38.5301 14.6058 6.1214 5.9925 0.0238 0.0835 0.1312 0.8287 37.8620 2.3309 2.3889 6.4780 0.5229 1.5194 12.8483 1.4615 2.4810 25.1495 8.0058 43.8585 58.4486 37.2019 2.5822 0.0027 0.1183 0.2804 0.4371 0.6806 2.6410 13.9118 17.8748 203.1104 36.7806 93.8293 0.2967 0.4633 0.5665 1.6666 0.5890 0.5076 2.5148 17.9100 0.9581 3.9696 5.3954 132.3233 63.0231 102.2082 95.3879 51.8882 2.7935 2.9776 17.6212 11.9598 3.7939 1.2440 0.5051 1.2491 1.9235
temp: 298.150 k
press: 1.00000 atm
elementType: 16 7 6 6 6 6 6 6 6 6 6 6 6 6 6 6 6 6 6 6 6 6 1 1 1 1 1 1 1 1 1 1 1 1 1 1 1 1 1 1 1 1 1 1 1 1 1 1 1 1 1 1 1 1 1 1 1 1
symmnumber: 1
zpe: 1358071.4 jmol-1
zpe.correction: 0.517262 hartree
zpe.thermalcorrener: 0.544664 hartree
zpe.thermalcorrenthalpy: 0.545608 hartree
zpe.thermalcorrgfe: 0.453264 hartree
zpe.sumelectzpe: -1234.557551 hartree
zpe.sumelectthermal: -1234.530150 hartree
zpe.sumelectthermalent: -1234.529206 hartree
zpe.sumelectthermalfe: -1234.621550 hartree
dipole: 25.9468 0.8869 -2.7083
dipole: 26.1028
quadrupole: 60.4043 -125.8432 -141.9909
quadrupole: 12.2250 -22.8190 2.3099
quadrupole: 129.5475 -56.6999 -72.8476 12.2250 -22.8190 2.3099
hfenergy: -1235.0748135 hartree
pointgroup: C01 [X(C20H36N1S1)]
dipole: -10.2101737 0.9071566 0.628247 debye
polarizability: 351.2632622|-20.4266673|214.772375|-6.6773992|-20.5250978|188.7948408 unknown
InChI: InChI=1S/C20H36NS/c1-4-5-6-7-8-9-10-11-12-13-14-22-18-21-16-19(2)15-20(3)17-21/h15-17H,4-14,18H2,1-3H3
charge 1 multiplicity 1
58 atoms
S  -3.368526 -0.845586 -1.587754
N  -5.265785 0.641524 -0.172493
C  4.52376 0.009686 -0.310372
C  5.816873 -0.561479 0.313786
C  3.266856 -0.828103 0.016322
C  7.075863 0.267124 -0.027524
C  1.978406 -0.260403 -0.620665
C  8.371722 -0.306538 0.588773
C  0.725901 -1.115251 -0.31648
C  9.631813 0.516726 0.238535
C  -0.554143 -0.543609 -0.976807
C  10.928683 -0.058178 0.85272
C  -1.778112 -1.426529 -0.69802
C  12.182614 0.768502 0.495023
C  -3.801986 0.644137 -0.517967
C  -5.760504 -0.366511 0.620217
C  -6.08499 1.622925 -0.675624
C  -7.12369 -0.413698 0.965002
C  -7.464953 1.6355 -0.387272
C  -7.967788 0.60394 0.445541
C  -7.657532 -1.516851 1.849165
C  -8.359107 2.713336 -0.956086
H  4.646839 0.070573 -1.41195
H  4.375577 1.051244 0.044155
H  5.961817 -1.605602 -0.034304
H  5.701426 -0.61473 1.416681
H  3.421845 -1.869409 -0.335119
H  3.141008 -0.886106 1.117702
H  6.935279 1.311221 0.322821
H  7.189656 0.322534 -1.130518
H  2.114987 -0.19085 -1.719612
H  1.81693 0.776423 -0.25878
H  8.510644 -1.35221 0.242484
H  8.262821 -0.356978 1.692566
H  0.895995 -2.149866 -0.678733
H  0.586326 -1.184784 0.782312
H  9.496736 1.562815 0.585292
H  9.742535 0.56764 -0.865049
H  -0.728404 0.486754 -0.603293
H  -0.402144 -0.463452 -2.070106
H  11.062886 -1.103681 0.507265
H  10.818899 -0.107181 1.955474
H  -2.007818 -1.503764 0.380688
H  -1.638358 -2.448725 -1.092214
H  12.333554 0.80643 -0.600406
H  13.09483 0.337183 0.946274
H  12.087726 1.810124 0.855922
H  -3.215697 0.590353 0.413417
H  -3.583044 1.584183 -1.043885
H  -5.043767 -1.125864 0.93882
H  -5.613685 2.380549 -1.305291
H  -9.036379 0.587679 0.689736
H  -8.457409 -2.079628 1.335522
H  -6.872222 -2.233821 2.137371
H  -8.095181 -1.102637 2.775335
H  -8.866938 3.271207 -0.14911
H  -7.79807 3.438436 -1.56716
H  -9.147476 2.273479 -1.593027
